BDBM14065 (2S)-1-[(2R)-2-amino-3-phenylpropanoyl]-N-[1-(1,3-benzothiazol-2-yl)-5-carbamimidamido-1-oxopentan-2-yl]pyrrolidine-2-carboxamide::2-ketobenzothiazole 5
SMILES: [#7]-[#6@H](-[#6]-c1ccccc1)-[#6](=O)-[#7]-1-[#6]-[#6]-[#6]-[#6@H]-1-[#6](=O)-[#7]-[#6](-[#6]-[#6]-[#6]\[#7]=[#6](\[#7])-[#7])-[#6](=O)-c1nc2ccccc2s1
InChI Key: InChIKey=XZUXATAIZFXMEK-IZWFHCBGSA-N
Data: 2 KI  1 IC50
Activity Spreadsheet -- Enzyme Inhibition Constant Data from BindingDB
Found 2 hits for monomerid = 14065
Trg + Lig
Ki
nM
ΔG°
kcal/mole
IC50
nM
Kd
nM
EC50/IC50
nM
koff
s-1
kon
M-1s-1
pHTemp
°C
Prothrombin
(Homo sapiens (Human))
BDBM14065
((2S)-1-[(2R)-2-amino-3-phenylpropanoyl]-N-[1-(1,3-...)
Show SMILES [#7]-[#6@H](-[#6]-c1ccccc1)-[#6](=O)-[#7]-1-[#6]-[#6]-[#6]-[#6@H]-1-[#6](=O)-[#7]-[#6](-[#6]-[#6]-[#6]\[#7]=[#6](\[#7])-[#7])-[#6](=O)-c1nc2ccccc2s1 |r|
Show InChI InChI=1S/C27H33N7O3S/c28-18(16-17-8-2-1-3-9-17)26(37)34-15-7-12-21(34)24(36)32-20(11-6-14-31-27(29)30)23(35)25-33-19-10-4-5-13-22(19)38-25/h1-5,8-10,13,18,20-21H,6-7,11-12,14-16,28H2,(H,32,36)(H4,29,30,31)/t18-,20?,21+/m1/s1
0.00550 -16.0 21n/an/an/an/a7.437
Johnson & Johnson Pharmaceutical
Assay Description
Thrombin-catalyzed hydrolysis rates were measured spectrophotometrically using human alpha-thrombin, a chromogenic substrate in aqueous buffer, and a...
J Med Chem 48: 1984-2008 (2005)
Article DOI: 10.1021/jm0303857
BindingDB Entry DOI: 10.7270/Q2X0658X
Trypsin
(Bos taurus (bovine))
BDBM14065
((2S)-1-[(2R)-2-amino-3-phenylpropanoyl]-N-[1-(1,3-...)
Show SMILES [#7]-[#6@H](-[#6]-c1ccccc1)-[#6](=O)-[#7]-1-[#6]-[#6]-[#6]-[#6@H]-1-[#6](=O)-[#7]-[#6](-[#6]-[#6]-[#6]\[#7]=[#6](\[#7])-[#7])-[#6](=O)-c1nc2ccccc2s1 |r|
Show InChI InChI=1S/C27H33N7O3S/c28-18(16-17-8-2-1-3-9-17)26(37)34-15-7-12-21(34)24(36)32-20(11-6-14-31-27(29)30)23(35)25-33-19-10-4-5-13-22(19)38-25/h1-5,8-10,13,18,20-21H,6-7,11-12,14-16,28H2,(H,32,36)(H4,29,30,31)/t18-,20?,21+/m1/s1
0.300n/an/an/an/an/an/an/an/a
Johnson & Johnson Pharmaceutical
Assay Description
Trypsin-catalyzed hydrolysis rates were measured spectrophotometrically using bovine trypsin, a chromogenic substrate in aqueous buffer, and a microp...
J Med Chem 48: 1984-2008 (2005)
Article DOI: 10.1021/jm0303857
BindingDB Entry DOI: 10.7270/Q2X0658X