BDBM14073 (2S)-N-[(2S)-1-(1,3-benzothiazol-2-yl)-5-carbamimidamido-1-oxopentan-2-yl]-1-[(2R)-2-(methylamino)-3,3-diphenylpropanoyl]pyrrolidine-2-carboxamide::2-ketobenzothiazole 13::CHEMBL403768
SMILES: [#6]-[#7]-[#6@H](-[#6](-c1ccccc1)-c1ccccc1)-[#6](=O)-[#7]-1-[#6]-[#6]-[#6]-[#6@H]-1-[#6](=O)-[#7]-[#6@@H](-[#6]-[#6]-[#6]\[#7]=[#6](\[#7])-[#7])-[#6](=O)-c1nc2ccccc2s1
InChI Key: InChIKey=CWBJELZFIFDKMX-QXTIUPHPSA-N
Data: 3 KI  3 IC50
Activity Spreadsheet -- Enzyme Inhibition Constant Data from BindingDB
Found 5 hits for monomerid = 14073
Trg + Lig
Ki
nM
ΔG°
kcal/mole
IC50
nM
Kd
nM
EC50/IC50
nM
koff
s-1
kon
M-1s-1
pHTemp
°C
Prothrombin
(Homo sapiens (Human))
BDBM14073
((2S)-N-[(2S)-1-(1,3-benzothiazol-2-yl)-5-carbamimi...)
Show SMILES [#6]-[#7]-[#6@H](-[#6](-c1ccccc1)-c1ccccc1)-[#6](=O)-[#7]-1-[#6]-[#6]-[#6]-[#6@H]-1-[#6](=O)-[#7]-[#6@@H](-[#6]-[#6]-[#6]\[#7]=[#6](\[#7])-[#7])-[#6](=O)-c1nc2ccccc2s1 |r|
Show InChI InChI=1S/C34H39N7O3S/c1-37-29(28(22-12-4-2-5-13-22)23-14-6-3-7-15-23)33(44)41-21-11-18-26(41)31(43)39-25(17-10-20-38-34(35)36)30(42)32-40-24-16-8-9-19-27(24)45-32/h2-9,12-16,19,25-26,28-29,37H,10-11,17-18,20-21H2,1H3,(H,39,43)(H4,35,36,38)/t25-,26-,29+/m0/s1
0.000650n/an/an/an/an/an/an/an/a
Johnson & Johnson Pharmaceutical Research & Development
Curated by ChEMBL
Assay Description
Binding affinity to human thrombin
J Med Chem 47: 769-87 (2004)
Article DOI: 10.1021/jm030493t
BindingDB Entry DOI: 10.7270/Q2251HN2
Prothrombin
(Homo sapiens (Human))
BDBM14073
((2S)-N-[(2S)-1-(1,3-benzothiazol-2-yl)-5-carbamimi...)
Show SMILES [#6]-[#7]-[#6@H](-[#6](-c1ccccc1)-c1ccccc1)-[#6](=O)-[#7]-1-[#6]-[#6]-[#6]-[#6@H]-1-[#6](=O)-[#7]-[#6@@H](-[#6]-[#6]-[#6]\[#7]=[#6](\[#7])-[#7])-[#6](=O)-c1nc2ccccc2s1 |r|
Show InChI InChI=1S/C34H39N7O3S/c1-37-29(28(22-12-4-2-5-13-22)23-14-6-3-7-15-23)33(44)41-21-11-18-26(41)31(43)39-25(17-10-20-38-34(35)36)30(42)32-40-24-16-8-9-19-27(24)45-32/h2-9,12-16,19,25-26,28-29,37H,10-11,17-18,20-21H2,1H3,(H,39,43)(H4,35,36,38)/t25-,26-,29+/m0/s1
0.000650 -17.3 4.5n/an/an/an/a7.437
Johnson & Johnson Pharmaceutical
Assay Description
Thrombin-catalyzed hydrolysis rates were measured spectrophotometrically using human alpha-thrombin, a chromogenic substrate in aqueous buffer, and a...
J Med Chem 48: 1984-2008 (2005)
Article DOI: 10.1021/jm0303857
BindingDB Entry DOI: 10.7270/Q2X0658X
Prothrombin
(Homo sapiens (Human))
BDBM14073
((2S)-N-[(2S)-1-(1,3-benzothiazol-2-yl)-5-carbamimi...)
Show SMILES [#6]-[#7]-[#6@H](-[#6](-c1ccccc1)-c1ccccc1)-[#6](=O)-[#7]-1-[#6]-[#6]-[#6]-[#6@H]-1-[#6](=O)-[#7]-[#6@@H](-[#6]-[#6]-[#6]\[#7]=[#6](\[#7])-[#7])-[#6](=O)-c1nc2ccccc2s1 |r|
Show InChI InChI=1S/C34H39N7O3S/c1-37-29(28(22-12-4-2-5-13-22)23-14-6-3-7-15-23)33(44)41-21-11-18-26(41)31(43)39-25(17-10-20-38-34(35)36)30(42)32-40-24-16-8-9-19-27(24)45-32/h2-9,12-16,19,25-26,28-29,37H,10-11,17-18,20-21H2,1H3,(H,39,43)(H4,35,36,38)/t25-,26-,29+/m0/s1
0.000650n/an/an/an/an/an/an/an/a
Johnson& Johnson Pharmaceutical Research& Development
Curated by ChEMBL
Assay Description
Inhibition of human alpha-thrombin
Bioorg Med Chem 16: 1562-95 (2008)
Article DOI: 10.1016/j.bmc.2007.11.015
BindingDB Entry DOI: 10.7270/Q21J9BNH
Trypsin
(Bos taurus (bovine))
BDBM14073
((2S)-N-[(2S)-1-(1,3-benzothiazol-2-yl)-5-carbamimi...)
Show SMILES [#6]-[#7]-[#6@H](-[#6](-c1ccccc1)-c1ccccc1)-[#6](=O)-[#7]-1-[#6]-[#6]-[#6]-[#6@H]-1-[#6](=O)-[#7]-[#6@@H](-[#6]-[#6]-[#6]\[#7]=[#6](\[#7])-[#7])-[#6](=O)-c1nc2ccccc2s1 |r|
Show InChI InChI=1S/C34H39N7O3S/c1-37-29(28(22-12-4-2-5-13-22)23-14-6-3-7-15-23)33(44)41-21-11-18-26(41)31(43)39-25(17-10-20-38-34(35)36)30(42)32-40-24-16-8-9-19-27(24)45-32/h2-9,12-16,19,25-26,28-29,37H,10-11,17-18,20-21H2,1H3,(H,39,43)(H4,35,36,38)/t25-,26-,29+/m0/s1
n/an/a 30n/an/an/an/an/an/a
Johnson & Johnson Pharmaceutical
Assay Description
Trypsin-catalyzed hydrolysis rates were measured spectrophotometrically using bovine trypsin, a chromogenic substrate in aqueous buffer, and a microp...
J Med Chem 48: 1984-2008 (2005)
Article DOI: 10.1021/jm0303857
BindingDB Entry DOI: 10.7270/Q2X0658X
Prothrombin
(Homo sapiens (Human))
BDBM14073
((2S)-N-[(2S)-1-(1,3-benzothiazol-2-yl)-5-carbamimi...)
Show SMILES [#6]-[#7]-[#6@H](-[#6](-c1ccccc1)-c1ccccc1)-[#6](=O)-[#7]-1-[#6]-[#6]-[#6]-[#6@H]-1-[#6](=O)-[#7]-[#6@@H](-[#6]-[#6]-[#6]\[#7]=[#6](\[#7])-[#7])-[#6](=O)-c1nc2ccccc2s1 |r|
Show InChI InChI=1S/C34H39N7O3S/c1-37-29(28(22-12-4-2-5-13-22)23-14-6-3-7-15-23)33(44)41-21-11-18-26(41)31(43)39-25(17-10-20-38-34(35)36)30(42)32-40-24-16-8-9-19-27(24)45-32/h2-9,12-16,19,25-26,28-29,37H,10-11,17-18,20-21H2,1H3,(H,39,43)(H4,35,36,38)/t25-,26-,29+/m0/s1
n/an/a 4.5n/an/an/an/an/an/a
Johnson & Johnson Pharmaceutical Research & Development
Curated by ChEMBL
Assay Description
Binding activity of the compound against human alpha thrombin
J Med Chem 47: 769-87 (2004)
Article DOI: 10.1021/jm030493t
BindingDB Entry DOI: 10.7270/Q2251HN2