BDBM141014 US8916576, 219
SMILES: COC(=O)Nc1ccccc1-c1nc(Nc2ccc3[nH]ncc3c2)c2ccccc2n1
InChI Key: InChIKey=GYNKPLMIZSPIBI-UHFFFAOYSA-N
Data: 1 IC50
Activity Spreadsheet -- Enzyme Inhibition Constant Data from BindingDB
Found 1 hit for monomerid = 141014
Trg + Lig
Ki
nM
ΔG°
kcal/mole
IC50
nM
Kd
nM
EC50/IC50
nM
koff
s-1
kon
M-1s-1
pHTemp
°C
Rho-associated protein kinase 2
(Homo sapiens (Human))
BDBM141014
(US8916576, 219)
Show SMILES COC(=O)Nc1ccccc1-c1nc(Nc2ccc3[nH]ncc3c2)c2ccccc2n1
Show InChI InChI=1S/C23H18N6O2/c1-31-23(30)27-20-9-5-3-7-17(20)22-26-19-8-4-2-6-16(19)21(28-22)25-15-10-11-18-14(12-15)13-24-29-18/h2-13H,1H3,(H,24,29)(H,27,30)(H,25,26,28)
US Patent
n/an/a 2.90E+3n/an/an/an/an/an/a
Surface Logix, Inc.
US Patent
Assay Description
ROCK-II inhibitory activity can be measured using the ROCK-II Assay Kit (Molecular Devices, inc.; Sunnyvale, Calif.).
US Patent US8916576 (2014)
BindingDB Entry DOI: 10.7270/Q2P55M6K