null
SMILES: Cc1nnsc1C(=O)Nc1ccc(c(F)c1)-n1nc(cc1C1CC1)C1CC1
InChI Key: InChIKey=UOXHLYMLCPPNGX-UHFFFAOYSA-N
Activity Spreadsheet -- Enzyme Inhibition Constant Data from BindingDB
Found 2 hits for monomerid = 141402
Trg + Lig
Ki
nM
ΔG°
kcal/mole
IC50
nM
Kd
nM
EC50/IC50
nM
koff
s-1
kon
M-1s-1
pHTemp
°C
Calcium release-activated calcium channel protein 1
(Homo sapiens (Human))
BDBM141402
(US10668051, Compound Example 28 | US8921364, 28)
Show SMILES Cc1nnsc1C(=O)Nc1ccc(c(F)c1)-n1nc(cc1C1CC1)C1CC1
Show InChI InChI=1S/C19H18FN5OS/c1-10-18(27-24-22-10)19(26)21-13-6-7-16(14(20)8-13)25-17(12-4-5-12)9-15(23-25)11-2-3-11/h6-9,11-12H,2-5H2,1H3,(H,21,26)
US Patent
n/an/a 60.3n/an/an/an/an/an/a
RHIZEN PHARMACEUTICALS SA
US Patent
Assay Description
Inhibition of CRAC channels was determined following thapsigargin (Sigma, Cat #T9033) induced endoplasmic calcium release in Jurkat cells, (see Yasur...
US Patent US10668051 (2020)
EF-hand calcium-binding domain-containing protein 4B
(Homo sapiens (Human))
BDBM141402
(US10668051, Compound Example 28 | US8921364, 28)
Show SMILES Cc1nnsc1C(=O)Nc1ccc(c(F)c1)-n1nc(cc1C1CC1)C1CC1
Show InChI InChI=1S/C19H18FN5OS/c1-10-18(27-24-22-10)19(26)21-13-6-7-16(14(20)8-13)25-17(12-4-5-12)9-15(23-25)11-2-3-11/h6-9,11-12H,2-5H2,1H3,(H,21,26)
US Patent
n/an/a 60.3n/an/an/an/an/a37
Rhizen Pharmaceuticals SA
US Patent
Assay Description
Inhibition of CRAC channels was determined following thapsigargin (Sigma, Cat # T9033) induced endoplasmic calcium release in Jurkat cells. (see Yasu...
US Patent US8921364 (2014)
BindingDB Entry DOI: 10.7270/Q2N58K3N