BDBM141416 US10668051, Compound Example 67::US8921364, 67
SMILES: Fc1cnccc1C(=O)Nc1ccc(cc1)-n1nc(cc1C1CC1)C(F)(F)F
InChI Key: InChIKey=MPBVNNVYYBZUBT-UHFFFAOYSA-N
Data: 2 IC50
Activity Spreadsheet -- Enzyme Inhibition Constant Data from BindingDB
Found 2 hits for monomerid = 141416
Trg + Lig
Ki
nM
ΔG°
kcal/mole
IC50
nM
Kd
nM
EC50/IC50
nM
koff
s-1
kon
M-1s-1
pHTemp
°C
Calcium release-activated calcium channel protein 1
(Homo sapiens (Human))
BDBM141416
(US10668051, Compound Example 67 | US8921364, 67)
Show SMILES Fc1cnccc1C(=O)Nc1ccc(cc1)-n1nc(cc1C1CC1)C(F)(F)F
Show InChI InChI=1S/C19H14F4N4O/c20-15-10-24-8-7-14(15)18(28)25-12-3-5-13(6-4-12)27-16(11-1-2-11)9-17(26-27)19(21,22)23/h3-11H,1-2H2,(H,25,28)
US Patent
n/an/a 20.4n/an/an/an/an/an/a
RHIZEN PHARMACEUTICALS SA
US Patent
Assay Description
Inhibition of CRAC channels was determined following thapsigargin (Sigma, Cat #T9033) induced endoplasmic calcium release in Jurkat cells, (see Yasur...
US Patent US10668051 (2020)
EF-hand calcium-binding domain-containing protein 4B
(Homo sapiens (Human))
BDBM141416
(US10668051, Compound Example 67 | US8921364, 67)
Show SMILES Fc1cnccc1C(=O)Nc1ccc(cc1)-n1nc(cc1C1CC1)C(F)(F)F
Show InChI InChI=1S/C19H14F4N4O/c20-15-10-24-8-7-14(15)18(28)25-12-3-5-13(6-4-12)27-16(11-1-2-11)9-17(26-27)19(21,22)23/h3-11H,1-2H2,(H,25,28)
US Patent
n/an/a 20.4n/an/an/an/an/a37
Rhizen Pharmaceuticals SA
US Patent
Assay Description
Inhibition of CRAC channels was determined following thapsigargin (Sigma, Cat # T9033) induced endoplasmic calcium release in Jurkat cells. (see Yasu...
US Patent US8921364 (2014)
BindingDB Entry DOI: 10.7270/Q2N58K3N