null
SMILES: Cc1ncsc1NC(=O)Nc1ccc(cc1)-n1nc(cc1C1CC1)C(F)(F)F
InChI Key: InChIKey=WCOKQJDIGRRKGH-UHFFFAOYSA-N
Activity Spreadsheet -- Enzyme Inhibition Constant Data from BindingDB
Found 2 hits for monomerid = 141420
Trg + Lig
Ki
nM
ΔG°
kcal/mole
IC50
nM
Kd
nM
EC50/IC50
nM
koff
s-1
kon
M-1s-1
pHTemp
°C
Calcium release-activated calcium channel protein 1
(Homo sapiens (Human))
BDBM141420
(US10668051, Compound Example 76 | US8921364, 76)
Show SMILES Cc1ncsc1NC(=O)Nc1ccc(cc1)-n1nc(cc1C1CC1)C(F)(F)F
Show InChI InChI=1S/C18H16F3N5OS/c1-10-16(28-9-22-10)24-17(27)23-12-4-6-13(7-5-12)26-14(11-2-3-11)8-15(25-26)18(19,20)21/h4-9,11H,2-3H2,1H3,(H2,23,24,27)
US Patent
n/an/a 269n/an/an/an/an/an/a
RHIZEN PHARMACEUTICALS SA
US Patent
Assay Description
Inhibition of CRAC channels was determined following thapsigargin (Sigma, Cat #T9033) induced endoplasmic calcium release in Jurkat cells, (see Yasur...
US Patent US10668051 (2020)
EF-hand calcium-binding domain-containing protein 4B
(Homo sapiens (Human))
BDBM141420
(US10668051, Compound Example 76 | US8921364, 76)
Show SMILES Cc1ncsc1NC(=O)Nc1ccc(cc1)-n1nc(cc1C1CC1)C(F)(F)F
Show InChI InChI=1S/C18H16F3N5OS/c1-10-16(28-9-22-10)24-17(27)23-12-4-6-13(7-5-12)26-14(11-2-3-11)8-15(25-26)18(19,20)21/h4-9,11H,2-3H2,1H3,(H2,23,24,27)
US Patent
n/an/a 269n/an/an/an/an/a37
Rhizen Pharmaceuticals SA
US Patent
Assay Description
Inhibition of CRAC channels was determined following thapsigargin (Sigma, Cat # T9033) induced endoplasmic calcium release in Jurkat cells. (see Yasu...
US Patent US8921364 (2014)
BindingDB Entry DOI: 10.7270/Q2N58K3N