BDBM141438 US10668051, Compound Example 104::US8921364, 104
SMILES: Cc1ccccc1C(=O)Nc1ccc(nc1)-n1nc(cc1C1CC1)C(F)(F)F
InChI Key: InChIKey=NETRIIZSLUUEKM-UHFFFAOYSA-N
Data: 2 IC50
Activity Spreadsheet -- Enzyme Inhibition Constant Data from BindingDB
Found 2 hits for monomerid = 141438
Trg + Lig
Ki
nM
ΔG°
kcal/mole
IC50
nM
Kd
nM
EC50/IC50
nM
koff
s-1
kon
M-1s-1
pHTemp
°C
Calcium release-activated calcium channel protein 1
(Homo sapiens (Human))
BDBM141438
(US10668051, Compound Example 104 | US8921364, 104)
Show SMILES Cc1ccccc1C(=O)Nc1ccc(nc1)-n1nc(cc1C1CC1)C(F)(F)F
Show InChI InChI=1S/C20H17F3N4O/c1-12-4-2-3-5-15(12)19(28)25-14-8-9-18(24-11-14)27-16(13-6-7-13)10-17(26-27)20(21,22)23/h2-5,8-11,13H,6-7H2,1H3,(H,25,28)
US Patent
n/an/a 23n/an/an/an/an/an/a
RHIZEN PHARMACEUTICALS SA
US Patent
Assay Description
Inhibition of CRAC channels was determined following thapsigargin (Sigma, Cat #T9033) induced endoplasmic calcium release in Jurkat cells, (see Yasur...
US Patent US10668051 (2020)
EF-hand calcium-binding domain-containing protein 4B
(Homo sapiens (Human))
BDBM141438
(US10668051, Compound Example 104 | US8921364, 104)
Show SMILES Cc1ccccc1C(=O)Nc1ccc(nc1)-n1nc(cc1C1CC1)C(F)(F)F
Show InChI InChI=1S/C20H17F3N4O/c1-12-4-2-3-5-15(12)19(28)25-14-8-9-18(24-11-14)27-16(13-6-7-13)10-17(26-27)20(21,22)23/h2-5,8-11,13H,6-7H2,1H3,(H,25,28)
US Patent
n/an/a 23.0n/an/an/an/an/a37
Rhizen Pharmaceuticals SA
US Patent
Assay Description
Inhibition of CRAC channels was determined following thapsigargin (Sigma, Cat # T9033) induced endoplasmic calcium release in Jurkat cells. (see Yasu...
US Patent US8921364 (2014)
BindingDB Entry DOI: 10.7270/Q2N58K3N