null
SMILES: Cc1ncsc1C(=O)Nc1ccc(cc1)-n1nc(cc1C(F)F)C(F)(F)F
InChI Key: InChIKey=AXWNMOKUOCPKID-UHFFFAOYSA-N
Activity Spreadsheet -- Enzyme Inhibition Constant Data from BindingDB
Found 2 hits for monomerid = 141448
Trg + Lig
Ki
nM
ΔG°
kcal/mole
IC50
nM
Kd
nM
EC50/IC50
nM
koff
s-1
kon
M-1s-1
pHTemp
°C
Calcium release-activated calcium channel protein 1
(Homo sapiens (Human))
BDBM141448
(US10668051, Compound Example 126 | US8921364, 126)
Show SMILES Cc1ncsc1C(=O)Nc1ccc(cc1)-n1nc(cc1C(F)F)C(F)(F)F
Show InChI InChI=1S/C16H11F5N4OS/c1-8-13(27-7-22-8)15(26)23-9-2-4-10(5-3-9)25-11(14(17)18)6-12(24-25)16(19,20)21/h2-7,14H,1H3,(H,23,26)
US Patent
n/an/a 52.6n/an/an/an/an/an/a
RHIZEN PHARMACEUTICALS SA
US Patent
Assay Description
Inhibition of CRAC channels was determined following thapsigargin (Sigma, Cat #T9033) induced endoplasmic calcium release in Jurkat cells, (see Yasur...
US Patent US10668051 (2020)
EF-hand calcium-binding domain-containing protein 4B
(Homo sapiens (Human))
BDBM141448
(US10668051, Compound Example 126 | US8921364, 126)
Show SMILES Cc1ncsc1C(=O)Nc1ccc(cc1)-n1nc(cc1C(F)F)C(F)(F)F
Show InChI InChI=1S/C16H11F5N4OS/c1-8-13(27-7-22-8)15(26)23-9-2-4-10(5-3-9)25-11(14(17)18)6-12(24-25)16(19,20)21/h2-7,14H,1H3,(H,23,26)
US Patent
n/an/a 52.6n/an/an/an/an/a37
Rhizen Pharmaceuticals SA
US Patent
Assay Description
Inhibition of CRAC channels was determined following thapsigargin (Sigma, Cat # T9033) induced endoplasmic calcium release in Jurkat cells. (see Yasu...
US Patent US8921364 (2014)
BindingDB Entry DOI: 10.7270/Q2N58K3N