BDBM14194 7-{bicyclo[2.2.1]heptan-2-yl}-N-[4-(4-methylpiperazin-1-yl)phenyl]-7H-pyrrolo[2,3-d]pyrimidin-2-amine::pyrrolopyrimidine 17
SMILES: CN1CCN(CC1)c1ccc(Nc2ncc3ccn(C4CC5CCC4C5)c3n2)cc1
InChI Key: InChIKey=ACDIRSKTMRLXAX-UHFFFAOYSA-N
Data: 2 IC50
Activity Spreadsheet -- Enzyme Inhibition Constant Data from BindingDB
Found 2 hits for monomerid = 14194
Trg + Lig
Ki
nM
ΔG°
kcal/mole
IC50
nM
Kd
nM
EC50/IC50
nM
koff
s-1
kon
M-1s-1
pHTemp
°C
Cyclin-Dependent Kinase 4 (CDK4)
(Homo sapiens (Human))
BDBM14194
(7-{bicyclo[2.2.1]heptan-2-yl}-N-[4-(4-methylpipera...)
Show SMILES CN1CCN(CC1)c1ccc(Nc2ncc3ccn(C4CC5CCC4C5)c3n2)cc1 |THB:18:19:25:23.22|
Show InChI InChI=1S/C24H30N6/c1-28-10-12-29(13-11-28)21-6-4-20(5-7-21)26-24-25-16-19-8-9-30(23(19)27-24)22-15-17-2-3-18(22)14-17/h4-9,16-18,22H,2-3,10-15H2,1H3,(H,25,26,27)
NCI pathway
Reactome pathway
n/an/a 29n/an/an/an/an/an/a
Johnson & Johnson Pharmaceutical
Assay Description
The compounds were tested for their ability to inhibit the phosphorylation of serine 795 of Rb by purified recombinant CDK4. The phosphorylation of s...
Bioorg Med Chem Lett 16: 5778-83 (2006)
Article DOI: 10.1016/j.bmcl.2006.08.080
BindingDB Entry DOI: 10.7270/Q2D21VVZ
Serine/threonine-protein kinase Aurora-A
(Mus musculus (mouse))
BDBM14194
(7-{bicyclo[2.2.1]heptan-2-yl}-N-[4-(4-methylpipera...)
Show SMILES CN1CCN(CC1)c1ccc(Nc2ncc3ccn(C4CC5CCC4C5)c3n2)cc1 |THB:18:19:25:23.22|
Show InChI InChI=1S/C24H30N6/c1-28-10-12-29(13-11-28)21-6-4-20(5-7-21)26-24-25-16-19-8-9-30(23(19)27-24)22-15-17-2-3-18(22)14-17/h4-9,16-18,22H,2-3,10-15H2,1H3,(H,25,26,27)
Reactome pathway
n/an/a 39n/an/an/an/a7.522
Johnson & Johnson Pharmaceutical
Assay Description
The compounds were tested for their ability to inhibit the phosphorylation of serine 10 of histone-H3 by purified recombinant murine Aurora-A enzyme....
Bioorg Med Chem Lett 16: 5778-83 (2006)
Article DOI: 10.1016/j.bmcl.2006.08.080
BindingDB Entry DOI: 10.7270/Q2D21VVZ