BDBM14207 N-[3-(4-methylpiperazin-1-yl)phenyl]-7-(pyridin-2-yl)-7H-pyrrolo[2,3-d]pyrimidin-2-amine::pyrrolopyrimidine 30
SMILES: CN1CCN(CC1)c1cccc(Nc2ncc3ccn(-c4ccccn4)c3n2)c1
InChI Key: InChIKey=RXLPNVPKEWSUHJ-UHFFFAOYSA-N
Data: 1 IC50
Activity Spreadsheet -- Enzyme Inhibition Constant Data from BindingDB
Found 1 hit for monomerid = 14207
Trg + Lig
Ki
nM
ΔG°
kcal/mole
IC50
nM
Kd
nM
EC50/IC50
nM
koff
s-1
kon
M-1s-1
pHTemp
°C
Serine/threonine-protein kinase Aurora-A
(Mus musculus (mouse))
BDBM14207
(N-[3-(4-methylpiperazin-1-yl)phenyl]-7-(pyridin-2-...)
Show SMILES CN1CCN(CC1)c1cccc(Nc2ncc3ccn(-c4ccccn4)c3n2)c1
Show InChI InChI=1S/C22H23N7/c1-27-11-13-28(14-12-27)19-6-4-5-18(15-19)25-22-24-16-17-8-10-29(21(17)26-22)20-7-2-3-9-23-20/h2-10,15-16H,11-14H2,1H3,(H,24,25,26)
Reactome pathway
n/an/a 5n/an/an/an/a7.522
Johnson & Johnson Pharmaceutical
Assay Description
The compounds were tested for their ability to inhibit the phosphorylation of serine 10 of histone-H3 by purified recombinant murine Aurora-A enzyme....
Bioorg Med Chem Lett 16: 5778-83 (2006)
Article DOI: 10.1016/j.bmcl.2006.08.080
BindingDB Entry DOI: 10.7270/Q2D21VVZ