BDBM142459 US8933224, 52
SMILES: Cc1nc([C@@H]2CCOC2)c2c(ncnn12)N1CCc2nc(nc(O)c2C1)C1CC1
InChI Key: InChIKey=HNDXIPPPKHQLFQ-CYBMUJFWSA-N
Data: 1 IC50
Activity Spreadsheet -- Enzyme Inhibition Constant Data from BindingDB
Found 1 hit for monomerid = 142459
Trg + Lig
Ki
nM
ΔG°
kcal/mole
IC50
nM
Kd
nM
EC50/IC50
nM
koff
s-1
kon
M-1s-1
pHTemp
°C
Phosphodiesterase Type 10 (PDE10A)
(Rattus norvegicus (rat))
BDBM142459
(US8933224, 52)
Show SMILES Cc1nc([C@@H]2CCOC2)c2c(ncnn12)N1CCc2nc(nc(O)c2C1)C1CC1 |r|
Show InChI InChI=1S/C20H23N7O2/c1-11-23-16(13-5-7-29-9-13)17-19(21-10-22-27(11)17)26-6-4-15-14(8-26)20(28)25-18(24-15)12-2-3-12/h10,12-13H,2-9H2,1H3,(H,24,25,28)/t13-/m1/s1
Reactome pathway
US Patent
n/an/a 0.101n/an/an/an/a7.5n/a
Pfizer Inc.
US Patent
Assay Description
The ability of a compound to inhibit PDE10 enzymatic activity can be demonstrated by any number of assays that are known in the art. The products of ...
US Patent US8933224 (2015)
BindingDB Entry DOI: 10.7270/Q2WM1C35