BDBM142493 US8933224, 86
SMILES: CC(C)c1nn(C)c2CCN(Cc12)c1ncnn2c(C)nc([C@@H]3CCOC3)c12
InChI Key: InChIKey=JQNFABHCPGZYEE-CQSZACIVSA-N
Data: 2 IC50
Activity Spreadsheet -- Enzyme Inhibition Constant Data from BindingDB
Found 2 hits for monomerid = 142493
Trg + Lig
Ki
nM
ΔG°
kcal/mole
IC50
nM
Kd
nM
EC50/IC50
nM
koff
s-1
kon
M-1s-1
pHTemp
°C
cAMP and cAMP-inhibited cGMP 3',5'-cyclic phosphodiesterase 10A
(Homo sapiens (Human))
BDBM142493
(US8933224, 86)
Show SMILES CC(C)c1nn(C)c2CCN(Cc12)c1ncnn2c(C)nc([C@@H]3CCOC3)c12 |r|
Show InChI InChI=1S/C20H27N7O/c1-12(2)17-15-9-26(7-5-16(15)25(4)24-17)20-19-18(14-6-8-28-10-14)23-13(3)27(19)22-11-21-20/h11-12,14H,5-10H2,1-4H3/t14-/m1/s1
Reactome pathway
US Patent
n/an/a 0.0444n/an/an/an/a7.5n/a
Pfizer Inc.
US Patent
Assay Description
The ability of a compound to inhibit PDE10 enzymatic activity can be demonstrated by any number of assays that are known in the art. The products of ...
US Patent US8933224 (2015)
BindingDB Entry DOI: 10.7270/Q2WM1C35
Phosphodiesterase Type 10 (PDE10A)
(Rattus norvegicus (rat))
BDBM142493
(US8933224, 86)
Show SMILES CC(C)c1nn(C)c2CCN(Cc12)c1ncnn2c(C)nc([C@@H]3CCOC3)c12 |r|
Show InChI InChI=1S/C20H27N7O/c1-12(2)17-15-9-26(7-5-16(15)25(4)24-17)20-19-18(14-6-8-28-10-14)23-13(3)27(19)22-11-21-20/h11-12,14H,5-10H2,1-4H3/t14-/m1/s1
Reactome pathway
US Patent
n/an/a 0.132n/an/an/an/a7.5n/a
Pfizer Inc.
US Patent
Assay Description
The ability of a compound to inhibit PDE10 enzymatic activity can be demonstrated by any number of assays that are known in the art. The products of ...
US Patent US8933224 (2015)
BindingDB Entry DOI: 10.7270/Q2WM1C35