BDBM142599 US8933228, 1
SMILES: Cc1ccc(cc1)-n1nc(cc1NC(=O)Nc1ccc(Oc2ccnc3[nH]c(=O)[nH]c23)c2ccccc12)C(C)(C)C
InChI Key: InChIKey=DGDQMZKPMBIFOF-UHFFFAOYSA-N
Data: 6 IC50
Activity Spreadsheet -- Enzyme Inhibition Constant Data from BindingDB
Found 6 hits for monomerid = 142599
Trg + Lig
Ki
nM
ΔG°
kcal/mole
IC50
nM
Kd
nM
EC50/IC50
nM
koff
s-1
kon
M-1s-1
pHTemp
°C
Mitogen-activated protein kinase 14
(Homo sapiens (Human))
BDBM142599
(US8933228, 1)
Show SMILES Cc1ccc(cc1)-n1nc(cc1NC(=O)Nc1ccc(Oc2ccnc3[nH]c(=O)[nH]c23)c2ccccc12)C(C)(C)C
Show InChI InChI=1S/C31H29N7O3/c1-18-9-11-19(12-10-18)38-26(17-25(37-38)31(2,3)4)34-29(39)33-22-13-14-23(21-8-6-5-7-20(21)22)41-24-15-16-32-28-27(24)35-30(40)36-28/h5-17H,1-4H3,(H2,33,34,39)(H2,32,35,36,40)
NCI pathway
Reactome pathway
US Patent
n/an/a 17n/an/an/an/an/an/a
Respivert, Ltd.
US Patent
Assay Description
The enzyme inhibitory activity of test compounds was determined by fluorescence resonance energy transfer (FRET) using synthetic peptides labelled wi...
US Patent US8933228 (2015)
BindingDB Entry DOI: 10.7270/Q2RV0MDW
Mitogen-activated protein kinase 12
(Homo sapiens (Human))
BDBM142599
(US8933228, 1)
Show SMILES Cc1ccc(cc1)-n1nc(cc1NC(=O)Nc1ccc(Oc2ccnc3[nH]c(=O)[nH]c23)c2ccccc12)C(C)(C)C
Show InChI InChI=1S/C31H29N7O3/c1-18-9-11-19(12-10-18)38-26(17-25(37-38)31(2,3)4)34-29(39)33-22-13-14-23(21-8-6-5-7-20(21)22)41-24-15-16-32-28-27(24)35-30(40)36-28/h5-17H,1-4H3,(H2,33,34,39)(H2,32,35,36,40)
Reactome pathway
US Patent
n/an/a 74n/an/an/an/an/an/a
Respivert, Ltd.
US Patent
Assay Description
The enzyme inhibitory activity of test compounds was determined by fluorescence resonance energy transfer (FRET) using synthetic peptides labelled wi...
US Patent US8933228 (2015)
BindingDB Entry DOI: 10.7270/Q2RV0MDW
Serine/threonine-protein kinase B-raf
(Homo sapiens (Human))
BDBM142599
(US8933228, 1)
Show SMILES Cc1ccc(cc1)-n1nc(cc1NC(=O)Nc1ccc(Oc2ccnc3[nH]c(=O)[nH]c23)c2ccccc12)C(C)(C)C
Show InChI InChI=1S/C31H29N7O3/c1-18-9-11-19(12-10-18)38-26(17-25(37-38)31(2,3)4)34-29(39)33-22-13-14-23(21-8-6-5-7-20(21)22)41-24-15-16-32-28-27(24)35-30(40)36-28/h5-17H,1-4H3,(H2,33,34,39)(H2,32,35,36,40)
NCI pathway
Reactome pathway
n/an/a 670n/an/an/an/an/an/a
The Institute of Cancer Research
Curated by ChEMBL
Assay Description
Inhibition of human BRAF V600E mutant expressed in baculovirus system
J Med Chem 53: 2741-56 (2010)
Article DOI: 10.1021/jm900607f
BindingDB Entry DOI: 10.7270/Q2WD43CH
Proto-oncogene tyrosine-protein kinase Src
(Homo sapiens (Human))
BDBM142599
(US8933228, 1)
Show SMILES Cc1ccc(cc1)-n1nc(cc1NC(=O)Nc1ccc(Oc2ccnc3[nH]c(=O)[nH]c23)c2ccccc12)C(C)(C)C
Show InChI InChI=1S/C31H29N7O3/c1-18-9-11-19(12-10-18)38-26(17-25(37-38)31(2,3)4)34-29(39)33-22-13-14-23(21-8-6-5-7-20(21)22)41-24-15-16-32-28-27(24)35-30(40)36-28/h5-17H,1-4H3,(H2,33,34,39)(H2,32,35,36,40)
US Patent
n/an/a 7n/an/an/an/an/an/a
Respivert, Ltd.
US Patent
Assay Description
The enzyme inhibitory activity of test compounds was determined by fluorescence resonance energy transfer (FRET) using synthetic peptides labelled wi...
US Patent US8933228 (2015)
BindingDB Entry DOI: 10.7270/Q2RV0MDW
Serine/threonine-protein kinase B-raf
(Homo sapiens (Human))
BDBM142599
(US8933228, 1)
Show SMILES Cc1ccc(cc1)-n1nc(cc1NC(=O)Nc1ccc(Oc2ccnc3[nH]c(=O)[nH]c23)c2ccccc12)C(C)(C)C
Show InChI InChI=1S/C31H29N7O3/c1-18-9-11-19(12-10-18)38-26(17-25(37-38)31(2,3)4)34-29(39)33-22-13-14-23(21-8-6-5-7-20(21)22)41-24-15-16-32-28-27(24)35-30(40)36-28/h5-17H,1-4H3,(H2,33,34,39)(H2,32,35,36,40)
NCI pathway
Reactome pathway
n/an/a 14n/an/an/an/an/an/a
The Institute of Cancer Research
Curated by ChEMBL
Assay Description
Inhibition of BRAF V600E mutant ERK phosphorylation in human WM266.4 cells
J Med Chem 53: 2741-56 (2010)
Article DOI: 10.1021/jm900607f
BindingDB Entry DOI: 10.7270/Q2WD43CH
Tyrosine-protein kinase HCK
(Homo sapiens (Human))
BDBM142599
(US8933228, 1)
Show SMILES Cc1ccc(cc1)-n1nc(cc1NC(=O)Nc1ccc(Oc2ccnc3[nH]c(=O)[nH]c23)c2ccccc12)C(C)(C)C
Show InChI InChI=1S/C31H29N7O3/c1-18-9-11-19(12-10-18)38-26(17-25(37-38)31(2,3)4)34-29(39)33-22-13-14-23(21-8-6-5-7-20(21)22)41-24-15-16-32-28-27(24)35-30(40)36-28/h5-17H,1-4H3,(H2,33,34,39)(H2,32,35,36,40)
Reactome pathway
US Patent
n/an/a<2n/an/an/an/an/an/a
Respivert, Ltd.
US Patent
Assay Description
The enzyme inhibitory activity of test compounds was determined by fluorescence resonance energy transfer (FRET) using synthetic peptides labelled wi...
US Patent US8933228 (2015)
BindingDB Entry DOI: 10.7270/Q2RV0MDW