BDBM142618 US8933228, 9
SMILES: COc1ccc(cc1)-n1nc(cc1NC(=O)Nc1ccc(Oc2ccnc3[nH]c(=O)[nH]c23)c2ccccc12)C(C)(C)C
InChI Key: InChIKey=CWIGGHRHBFIADD-UHFFFAOYSA-N
Data: 4 IC50
Activity Spreadsheet -- Enzyme Inhibition Constant Data from BindingDB
Found 4 hits for monomerid = 142618
Trg + Lig
Ki
nM
ΔG°
kcal/mole
IC50
nM
Kd
nM
EC50/IC50
nM
koff
s-1
kon
M-1s-1
pHTemp
°C
Mitogen-activated protein kinase 14
(Homo sapiens (Human))
BDBM142618
(US8933228, 9)
Show SMILES COc1ccc(cc1)-n1nc(cc1NC(=O)Nc1ccc(Oc2ccnc3[nH]c(=O)[nH]c23)c2ccccc12)C(C)(C)C
Show InChI InChI=1S/C31H29N7O4/c1-31(2,3)25-17-26(38(37-25)18-9-11-19(41-4)12-10-18)34-29(39)33-22-13-14-23(21-8-6-5-7-20(21)22)42-24-15-16-32-28-27(24)35-30(40)36-28/h5-17H,1-4H3,(H2,33,34,39)(H2,32,35,36,40)
NCI pathway
Reactome pathway
US Patent
n/an/a 21n/an/an/an/an/an/a
Respivert, Ltd.
US Patent
Assay Description
The enzyme inhibitory activity of test compounds was determined by fluorescence resonance energy transfer (FRET) using synthetic peptides labelled wi...
US Patent US8933228 (2015)
BindingDB Entry DOI: 10.7270/Q2RV0MDW
Proto-oncogene tyrosine-protein kinase Src
(Homo sapiens (Human))
BDBM142618
(US8933228, 9)
Show SMILES COc1ccc(cc1)-n1nc(cc1NC(=O)Nc1ccc(Oc2ccnc3[nH]c(=O)[nH]c23)c2ccccc12)C(C)(C)C
Show InChI InChI=1S/C31H29N7O4/c1-31(2,3)25-17-26(38(37-25)18-9-11-19(41-4)12-10-18)34-29(39)33-22-13-14-23(21-8-6-5-7-20(21)22)42-24-15-16-32-28-27(24)35-30(40)36-28/h5-17H,1-4H3,(H2,33,34,39)(H2,32,35,36,40)
US Patent
n/an/a 7n/an/an/an/an/an/a
Respivert, Ltd.
US Patent
Assay Description
The enzyme inhibitory activity of test compounds was determined by fluorescence resonance energy transfer (FRET) using synthetic peptides labelled wi...
US Patent US8933228 (2015)
BindingDB Entry DOI: 10.7270/Q2RV0MDW
Tyrosine-protein kinase HCK
(Homo sapiens (Human))
BDBM142618
(US8933228, 9)
Show SMILES COc1ccc(cc1)-n1nc(cc1NC(=O)Nc1ccc(Oc2ccnc3[nH]c(=O)[nH]c23)c2ccccc12)C(C)(C)C
Show InChI InChI=1S/C31H29N7O4/c1-31(2,3)25-17-26(38(37-25)18-9-11-19(41-4)12-10-18)34-29(39)33-22-13-14-23(21-8-6-5-7-20(21)22)42-24-15-16-32-28-27(24)35-30(40)36-28/h5-17H,1-4H3,(H2,33,34,39)(H2,32,35,36,40)
Reactome pathway
US Patent
n/an/a<2n/an/an/an/an/an/a
Respivert, Ltd.
US Patent
Assay Description
The enzyme inhibitory activity of test compounds was determined by fluorescence resonance energy transfer (FRET) using synthetic peptides labelled wi...
US Patent US8933228 (2015)
BindingDB Entry DOI: 10.7270/Q2RV0MDW
Mitogen-activated protein kinase 12
(Homo sapiens (Human))
BDBM142618
(US8933228, 9)
Show SMILES COc1ccc(cc1)-n1nc(cc1NC(=O)Nc1ccc(Oc2ccnc3[nH]c(=O)[nH]c23)c2ccccc12)C(C)(C)C
Show InChI InChI=1S/C31H29N7O4/c1-31(2,3)25-17-26(38(37-25)18-9-11-19(41-4)12-10-18)34-29(39)33-22-13-14-23(21-8-6-5-7-20(21)22)42-24-15-16-32-28-27(24)35-30(40)36-28/h5-17H,1-4H3,(H2,33,34,39)(H2,32,35,36,40)
Reactome pathway
US Patent
n/an/a 119n/an/an/an/an/an/a
Respivert, Ltd.
US Patent
Assay Description
The enzyme inhibitory activity of test compounds was determined by fluorescence resonance energy transfer (FRET) using synthetic peptides labelled wi...
US Patent US8933228 (2015)
BindingDB Entry DOI: 10.7270/Q2RV0MDW