BDBM142705 US8937084, 7
SMILES: Oc1ccc2C[C@@H]3[C@@H]4CNC(=O)C[C@]4(CCN3CC3CC3)c2c1
InChI Key: InChIKey=XYEIPZFSMVUKKD-YQVWRLOYSA-N
Data: 3 KI
Activity Spreadsheet -- Enzyme Inhibition Constant Data from BindingDB
Found 3 hits for monomerid = 142705
Trg + Lig
Ki
nM
ΔG°
kcal/mole
IC50
nM
Kd
nM
EC50/IC50
nM
koff
s-1
kon
M-1s-1
pHTemp
°C
Kappa-type opioid receptor
(Homo sapiens (Human))
BDBM142705
(US8937084, 7)
Show SMILES Oc1ccc2C[C@@H]3[C@@H]4CNC(=O)C[C@]4(CCN3CC3CC3)c2c1 |r|
Show InChI InChI=1S/C19H24N2O2/c22-14-4-3-13-7-17-16-10-20-18(23)9-19(16,15(13)8-14)5-6-21(17)11-12-1-2-12/h3-4,8,12,16-17,22H,1-2,5-7,9-11H2,(H,20,23)/t16-,17+,19+/m0/s1
Reactome pathway
US Patent
0.180 -14.4n/an/an/an/an/a7.450
Purdue Pharma L.P.
US Patent
Assay Description
Radioligand dose-displacement binding assays for u-opioid receptors used 0.3 nM [3H]-diprenorphine (Perkin Elmer, Shelton, Conn.), with 5 mg membrane...
US Patent US8937084 (2015)
BindingDB Entry DOI: 10.7270/Q2CJ8C5C
Mu-type opioid receptor
(Homo sapiens (Human))
BDBM142705
(US8937084, 7)
Show SMILES Oc1ccc2C[C@@H]3[C@@H]4CNC(=O)C[C@]4(CCN3CC3CC3)c2c1 |r|
Show InChI InChI=1S/C19H24N2O2/c22-14-4-3-13-7-17-16-10-20-18(23)9-19(16,15(13)8-14)5-6-21(17)11-12-1-2-12/h3-4,8,12,16-17,22H,1-2,5-7,9-11H2,(H,20,23)/t16-,17+,19+/m0/s1
NCI pathway
Reactome pathway
US Patent
5.61 -12.2n/an/an/an/an/a7.450
Purdue Pharma L.P.
US Patent
Assay Description
Radioligand dose-displacement binding assays for u-opioid receptors used 0.3 nM [3H]-diprenorphine (Perkin Elmer, Shelton, Conn.), with 5 mg membrane...
US Patent US8937084 (2015)
BindingDB Entry DOI: 10.7270/Q2CJ8C5C
Delta-type opioid receptor
(Homo sapiens (Human))
BDBM142705
(US8937084, 7)
Show SMILES Oc1ccc2C[C@@H]3[C@@H]4CNC(=O)C[C@]4(CCN3CC3CC3)c2c1 |r|
Show InChI InChI=1S/C19H24N2O2/c22-14-4-3-13-7-17-16-10-20-18(23)9-19(16,15(13)8-14)5-6-21(17)11-12-1-2-12/h3-4,8,12,16-17,22H,1-2,5-7,9-11H2,(H,20,23)/t16-,17+,19+/m0/s1
Reactome pathway
US Patent
15.0 -11.6n/an/an/an/an/a7.450
Purdue Pharma L.P.
US Patent
Assay Description
Radioligand dose-displacement binding assays for u-opioid receptors used 0.3 nM [3H]-diprenorphine (Perkin Elmer, Shelton, Conn.), with 5 mg membrane...
US Patent US8937084 (2015)
BindingDB Entry DOI: 10.7270/Q2CJ8C5C