null
SMILES: O[C@@H]1CN(CC[C@H]1NC(=O)OC1COC1)c1cc(cc(Nc2nc(NC3CC3)c3ncc(C#N)n3n2)c1Cl)C#N
InChI Key: InChIKey=UHQWLOYGKGHCMN-YLJYHZDGSA-N
Activity Spreadsheet -- Enzyme Inhibition Constant Data from BindingDB
Found 2 hits for monomerid = 142799
Trg + Lig
Ki
nM
ΔG°
kcal/mole
IC50
nM
Kd
nM
EC50/IC50
nM
koff
s-1
kon
M-1s-1
pHTemp
°C
Casein kinase II subunit alpha'
(Homo sapiens (Human))
BDBM142799
(US8940736, 179)
Show SMILES O[C@@H]1CN(CC[C@H]1NC(=O)OC1COC1)c1cc(cc(Nc2nc(NC3CC3)c3ncc(C#N)n3n2)c1Cl)C#N |r|
Show InChI InChI=1S/C25H25ClN10O4/c26-21-18(31-24-33-22(30-14-1-2-14)23-29-9-15(8-28)36(23)34-24)5-13(7-27)6-19(21)35-4-3-17(20(37)10-35)32-25(38)40-16-11-39-12-16/h5-6,9,14,16-17,20,37H,1-4,10-12H2,(H,32,38)(H2,30,31,33,34)/t17-,20-/m1/s1
Reactome pathway
US Patent
n/an/a 0.260n/an/an/an/a7.430
Bristol-Myers Squibb Company
US Patent
Assay Description
The effectiveness of compounds of the present invention as inhibitors of protein kinases can be readily tested by assays known to those skilled in th...
US Patent US8940736 (2015)
BindingDB Entry DOI: 10.7270/Q2QV3K72
Casein kinase II subunit alpha
(Homo sapiens (Human))
BDBM142799
(US8940736, 179)
Show SMILES O[C@@H]1CN(CC[C@H]1NC(=O)OC1COC1)c1cc(cc(Nc2nc(NC3CC3)c3ncc(C#N)n3n2)c1Cl)C#N |r|
Show InChI InChI=1S/C25H25ClN10O4/c26-21-18(31-24-33-22(30-14-1-2-14)23-29-9-15(8-28)36(23)34-24)5-13(7-27)6-19(21)35-4-3-17(20(37)10-35)32-25(38)40-16-11-39-12-16/h5-6,9,14,16-17,20,37H,1-4,10-12H2,(H,32,38)(H2,30,31,33,34)/t17-,20-/m1/s1
US Patent
n/an/a 1.36n/an/an/an/a7.430
Bristol-Myers Squibb Company
US Patent
Assay Description
The effectiveness of compounds of the present invention as inhibitors of protein kinases can be readily tested by assays known to those skilled in th...
US Patent US8940736 (2015)
BindingDB Entry DOI: 10.7270/Q2QV3K72