BDBM143511 US8969341, 126
SMILES: COc1ccc(CN)cc1-n1nc2C(=O)N(C(c2c1C(C)C)c1ccc(Cl)cc1C)c1cc(Cl)ccc1C
InChI Key: InChIKey=ZJWOFSLLBIUKPW-UHFFFAOYSA-N
Data: 3 IC50
Activity Spreadsheet -- Enzyme Inhibition Constant Data from BindingDB
Found 3 hits for monomerid = 143511
Trg + Lig
Ki
nM
ΔG°
kcal/mole
IC50
nM
Kd
nM
EC50/IC50
nM
koff
s-1
kon
M-1s-1
pHTemp
°C
MDM2-MDMX
(Homo sapiens (Human))
BDBM143511
(US8969341, 126)
Show SMILES COc1ccc(CN)cc1-n1nc2C(=O)N(C(c2c1C(C)C)c1ccc(Cl)cc1C)c1cc(Cl)ccc1C
Show InChI InChI=1S/C30H30Cl2N4O2/c1-16(2)28-26-27(34-36(28)24-13-19(15-33)7-11-25(24)38-5)30(37)35(23-14-21(32)8-6-17(23)3)29(26)22-10-9-20(31)12-18(22)4/h6-14,16,29H,15,33H2,1-5H3
NCI pathway
Reactome pathway
US Patent
n/an/a 1.20n/an/an/an/an/an/a
Novartis AG
US Patent
Assay Description
The inhibition of p53-MDM2 and p53-MDM4 interactions is measured by time resolved fluorescence energy transfer (TR-FRET). Fluorescence energy transfe...
US Patent US8969341 (2015)
BindingDB Entry DOI: 10.7270/Q2K35SC8
MDM2-MDMX
(Homo sapiens (Human))
BDBM143511
(US8969341, 126)
Show SMILES COc1ccc(CN)cc1-n1nc2C(=O)N(C(c2c1C(C)C)c1ccc(Cl)cc1C)c1cc(Cl)ccc1C
Show InChI InChI=1S/C30H30Cl2N4O2/c1-16(2)28-26-27(34-36(28)24-13-19(15-33)7-11-25(24)38-5)30(37)35(23-14-21(32)8-6-17(23)3)29(26)22-10-9-20(31)12-18(22)4/h6-14,16,29H,15,33H2,1-5H3
NCI pathway
Reactome pathway
US Patent
n/an/a 0.146n/an/an/an/an/an/a
Novartis AG
US Patent
Assay Description
The inhibition of p53-MDM2 and p53-MDM4 interactions is measured by time resolved fluorescence energy transfer (TR-FRET). Fluorescence energy transfe...
US Patent US8969341 (2015)
BindingDB Entry DOI: 10.7270/Q2K35SC8
p53-Binding Protein HDMX
(Homo sapiens (Human))
BDBM143511
(US8969341, 126)
Show SMILES COc1ccc(CN)cc1-n1nc2C(=O)N(C(c2c1C(C)C)c1ccc(Cl)cc1C)c1cc(Cl)ccc1C
Show InChI InChI=1S/C30H30Cl2N4O2/c1-16(2)28-26-27(34-36(28)24-13-19(15-33)7-11-25(24)38-5)30(37)35(23-14-21(32)8-6-17(23)3)29(26)22-10-9-20(31)12-18(22)4/h6-14,16,29H,15,33H2,1-5H3
NCI pathway
US Patent
n/an/a 150n/an/an/an/an/an/a
Novartis AG
US Patent
Assay Description
The inhibition of p53-MDM2 and p53-MDM4 interactions is measured by time resolved fluorescence energy transfer (TR-FRET). Fluorescence energy transfe...
US Patent US8969341 (2015)
BindingDB Entry DOI: 10.7270/Q2K35SC8