BDBM143548 US8969341, 143
SMILES: COc1ccccc1-n1nc2C(=O)N([C@H](c2c1C(C)C)c1ccc(Cl)cc1C)c1cc(Cl)ccc1OCCN(C)C
InChI Key: InChIKey=YBMQYNARIZUNIO-HKBQPEDESA-N
Data: 3 IC50
PDB links: 1 PDB ID matches this monomer.
Activity Spreadsheet -- Enzyme Inhibition Constant Data from BindingDB
Found 3 hits for monomerid = 143548
Trg + Lig
Ki
nM
ΔG°
kcal/mole
IC50
nM
Kd
nM
EC50/IC50
nM
koff
s-1
kon
M-1s-1
pHTemp
°C
MDM2-MDMX
(Homo sapiens (Human))
BDBM143548
(US8969341, 143)
Show SMILES COc1ccccc1-n1nc2C(=O)N([C@H](c2c1C(C)C)c1ccc(Cl)cc1C)c1cc(Cl)ccc1OCCN(C)C |r|
Show InChI InChI=1S/C32H34Cl2N4O3/c1-19(2)30-28-29(35-38(30)24-9-7-8-10-26(24)40-6)32(39)37(31(28)23-13-11-21(33)17-20(23)3)25-18-22(34)12-14-27(25)41-16-15-36(4)5/h7-14,17-19,31H,15-16H2,1-6H3/t31-/m0/s1
NCI pathway
Reactome pathway
US Patent
n/an/a 0.5n/an/an/an/an/an/a
Novartis AG
US Patent
Assay Description
The inhibition of p53-MDM2 and p53-MDM4 interactions is measured by time resolved fluorescence energy transfer (TR-FRET). Fluorescence energy transfe...
US Patent US8969341 (2015)
BindingDB Entry DOI: 10.7270/Q2K35SC8
3D
3D Structure (crystal)
MDM2-MDMX
(Homo sapiens (Human))
BDBM143548
(US8969341, 143)
Show SMILES COc1ccccc1-n1nc2C(=O)N([C@H](c2c1C(C)C)c1ccc(Cl)cc1C)c1cc(Cl)ccc1OCCN(C)C |r|
Show InChI InChI=1S/C32H34Cl2N4O3/c1-19(2)30-28-29(35-38(30)24-9-7-8-10-26(24)40-6)32(39)37(31(28)23-13-11-21(33)17-20(23)3)25-18-22(34)12-14-27(25)41-16-15-36(4)5/h7-14,17-19,31H,15-16H2,1-6H3/t31-/m0/s1
NCI pathway
Reactome pathway
US Patent
n/an/a 0.101n/an/an/an/an/an/a
Novartis AG
US Patent
Assay Description
The inhibition of p53-MDM2 and p53-MDM4 interactions is measured by time resolved fluorescence energy transfer (TR-FRET). Fluorescence energy transfe...
US Patent US8969341 (2015)
BindingDB Entry DOI: 10.7270/Q2K35SC8
3D
3D Structure (crystal)
p53-Binding Protein HDMX
(Homo sapiens (Human))
BDBM143548
(US8969341, 143)
Show SMILES COc1ccccc1-n1nc2C(=O)N([C@H](c2c1C(C)C)c1ccc(Cl)cc1C)c1cc(Cl)ccc1OCCN(C)C |r|
Show InChI InChI=1S/C32H34Cl2N4O3/c1-19(2)30-28-29(35-38(30)24-9-7-8-10-26(24)40-6)32(39)37(31(28)23-13-11-21(33)17-20(23)3)25-18-22(34)12-14-27(25)41-16-15-36(4)5/h7-14,17-19,31H,15-16H2,1-6H3/t31-/m0/s1
NCI pathway
US Patent
n/an/a 489n/an/an/an/an/an/a
Novartis AG
US Patent
Assay Description
The inhibition of p53-MDM2 and p53-MDM4 interactions is measured by time resolved fluorescence energy transfer (TR-FRET). Fluorescence energy transfe...
US Patent US8969341 (2015)
BindingDB Entry DOI: 10.7270/Q2K35SC8