null
SMILES: CN(CCCC(=O)Nc1cccc(CCNC[C@H](O)c2ccc(O)c3[nH]c(=O)ccc23)c1)C(=O)CCN1CCC(CC1)OC(=O)Nc1ccccc1-c1ccccc1
InChI Key:
Activity Spreadsheet -- Enzyme Inhibition Constant Data from BindingDB
Found 3 hits for monomerid = 143688
Trg + Lig
Ki
nM
ΔG°
kcal/mole
IC50
nM
Kd
nM
EC50/IC50
nM
koff
s-1
kon
M-1s-1
pHTemp
°C
Muscarinic acetylcholine receptor M3
(Homo sapiens (Human))
BDBM143688
(US9572802, Compound I-7 | US9682957, I-7)
Show SMILES CN(CCCC(=O)Nc1cccc(CCNC[C@H](O)c2ccc(O)c3[nH]c(=O)ccc23)c1)C(=O)CCN1CCC(CC1)OC(=O)Nc1ccccc1-c1ccccc1 |r|
Reactome pathway
US Patent
0.100n/an/an/an/an/an/an/an/a
Theravance Respiratory Company, LLC
US Patent
Assay Description
Radioligand binding assays for cloned muscarinic receptors were performed in 96-well microtiter plates in a total assay volume of 100 μL. CHO ce...
US Patent US9682957 (2017)
BindingDB Entry DOI: 10.7270/Q23776WR
Muscarinic acetylcholine receptor M3
(Homo sapiens (Human))
BDBM143688
(US9572802, Compound I-7 | US9682957, I-7)
Show SMILES CN(CCCC(=O)Nc1cccc(CCNC[C@H](O)c2ccc(O)c3[nH]c(=O)ccc23)c1)C(=O)CCN1CCC(CC1)OC(=O)Nc1ccccc1-c1ccccc1 |r|
Reactome pathway
US Patent
0.100n/an/an/an/an/an/an/an/a
Theravance Respiratory Company LLC
US Patent
Assay Description
compounds were performed with [3H]NMS at 1 nM and eleven different test compound concentrations. The test compounds were initially dissolved to a con...
US Patent US9572802 (2017)
BindingDB Entry DOI: 10.7270/Q2VH5QWS
Beta-2 adrenergic receptor
(Homo sapiens (Human))
BDBM143688
(US9572802, Compound I-7 | US9682957, I-7)
Show SMILES CN(CCCC(=O)Nc1cccc(CCNC[C@H](O)c2ccc(O)c3[nH]c(=O)ccc23)c1)C(=O)CCN1CCC(CC1)OC(=O)Nc1ccccc1-c1ccccc1 |r|
Reactome pathway
US Patent
n/an/an/an/a 1n/an/an/a25
Theravance Respiratory Company, LLC
US Patent
Assay Description
cAMP assays were performed in a radioimmunoassay format using the Flashplate Adenylyl Cyclase Activation Assay System with [125I]-cAMP (NEN SMP004, P...
US Patent US9682957 (2017)
BindingDB Entry DOI: 10.7270/Q23776WR