null
SMILES: OCc1ccc2c(ccnc2c1)-c1cnn2cc(cnc12)-c1ccc(cc1)N1CCNCC1
InChI Key: InChIKey=UOAHJPVGHFVHGE-UHFFFAOYSA-N
Activity Spreadsheet -- Enzyme Inhibition Constant Data from BindingDB
Found 8 hits for monomerid = 143722
Trg + Lig
Ki
nM
ΔG°
kcal/mole
IC50
nM
Kd
nM
EC50/IC50
nM
koff
s-1
kon
M-1s-1
pHTemp
°C
Serine/threonine-protein kinase receptor R3
(Homo sapiens (Human))
BDBM143722
(US10017516, Compound 16 | US9682983, 16)
Show SMILES OCc1ccc2c(ccnc2c1)-c1cnn2cc(cnc12)-c1ccc(cc1)N1CCNCC1
Show InChI InChI=1S/C26H24N6O/c33-17-18-1-6-23-22(7-8-28-25(23)13-18)24-15-30-32-16-20(14-29-26(24)32)19-2-4-21(5-3-19)31-11-9-27-10-12-31/h1-8,13-16,27,33H,9-12,17H2
US Patent
n/an/a 207n/an/an/an/a7.5n/a
The Brigham and Women's Hospital, Inc.; Dept. of Health and Human Services, National Institutes of Health
US Patent
Assay Description
Specifically, compounds were assayed using LANCE® Ultra ULight¿ technology (Perkin Elmer) against human ALK1-6 enzymes (ALK1: Life Technologies, ALK2...
US Patent US9682983 (2017)
BindingDB Entry DOI: 10.7270/Q28S4N3R
Activin receptor type-1
(Homo sapiens (Human))
BDBM143722
(US10017516, Compound 16 | US9682983, 16)
Show SMILES OCc1ccc2c(ccnc2c1)-c1cnn2cc(cnc12)-c1ccc(cc1)N1CCNCC1
Show InChI InChI=1S/C26H24N6O/c33-17-18-1-6-23-22(7-8-28-25(23)13-18)24-15-30-32-16-20(14-29-26(24)32)19-2-4-21(5-3-19)31-11-9-27-10-12-31/h1-8,13-16,27,33H,9-12,17H2
US Patent
n/an/a 102n/an/an/an/a7.5n/a
The Brigham and Women's Hospital, Inc.; Dept. of Health and Human Services, National Institutes of Health
US Patent
Assay Description
Specifically, compounds were assayed using LANCE® Ultra ULight¿ technology (Perkin Elmer) against human ALK1-6 enzymes (ALK1: Life Technologies, ALK2...
US Patent US9682983 (2017)
BindingDB Entry DOI: 10.7270/Q28S4N3R
Bone morphogenetic protein receptor type-1A
(Homo sapiens (Human))
BDBM143722
(US10017516, Compound 16 | US9682983, 16)
Show SMILES OCc1ccc2c(ccnc2c1)-c1cnn2cc(cnc12)-c1ccc(cc1)N1CCNCC1
Show InChI InChI=1S/C26H24N6O/c33-17-18-1-6-23-22(7-8-28-25(23)13-18)24-15-30-32-16-20(14-29-26(24)32)19-2-4-21(5-3-19)31-11-9-27-10-12-31/h1-8,13-16,27,33H,9-12,17H2
US Patent
n/an/a 573n/an/an/an/a7.5n/a
The Brigham and Women's Hospital, Inc.; Dept. of Health and Human Services, National Institutes of Health
US Patent
Assay Description
Specifically, compounds were assayed using LANCE® Ultra ULight¿ technology (Perkin Elmer) against human ALK1-6 enzymes (ALK1: Life Technologies, ALK2...
US Patent US9682983 (2017)
BindingDB Entry DOI: 10.7270/Q28S4N3R
Bone morphogenetic protein receptor type-1B
(Homo sapiens (Human))
BDBM143722
(US10017516, Compound 16 | US9682983, 16)
Show SMILES OCc1ccc2c(ccnc2c1)-c1cnn2cc(cnc12)-c1ccc(cc1)N1CCNCC1
Show InChI InChI=1S/C26H24N6O/c33-17-18-1-6-23-22(7-8-28-25(23)13-18)24-15-30-32-16-20(14-29-26(24)32)19-2-4-21(5-3-19)31-11-9-27-10-12-31/h1-8,13-16,27,33H,9-12,17H2
US Patent
n/an/a 424n/an/an/an/an/an/a
The Brigham and Women's Hospital, Inc.
US Patent
Assay Description
Compounds were assessed in ALK1-6 enzymatic assays. Specifically, compounds were assayed using LANCE® Ultra ULight technology (Perkin Elmer) against ...
US Patent US10017516 (2018)
BindingDB Entry DOI: 10.7270/Q20P12CN
Serine/threonine-protein kinase receptor R3
(Homo sapiens (Human))
BDBM143722
(US10017516, Compound 16 | US9682983, 16)
Show SMILES OCc1ccc2c(ccnc2c1)-c1cnn2cc(cnc12)-c1ccc(cc1)N1CCNCC1
Show InChI InChI=1S/C26H24N6O/c33-17-18-1-6-23-22(7-8-28-25(23)13-18)24-15-30-32-16-20(14-29-26(24)32)19-2-4-21(5-3-19)31-11-9-27-10-12-31/h1-8,13-16,27,33H,9-12,17H2
US Patent
n/an/a 207n/an/an/an/an/an/a
The Brigham and Women's Hospital, Inc.
US Patent
Assay Description
Compounds were assessed in ALK1-6 enzymatic assays. Specifically, compounds were assayed using LANCE® Ultra ULight technology (Perkin Elmer) against ...
US Patent US10017516 (2018)
BindingDB Entry DOI: 10.7270/Q20P12CN
Activin receptor type-1
(Homo sapiens (Human))
BDBM143722
(US10017516, Compound 16 | US9682983, 16)
Show SMILES OCc1ccc2c(ccnc2c1)-c1cnn2cc(cnc12)-c1ccc(cc1)N1CCNCC1
Show InChI InChI=1S/C26H24N6O/c33-17-18-1-6-23-22(7-8-28-25(23)13-18)24-15-30-32-16-20(14-29-26(24)32)19-2-4-21(5-3-19)31-11-9-27-10-12-31/h1-8,13-16,27,33H,9-12,17H2
US Patent
n/an/a 102n/an/an/an/an/an/a
The Brigham and Women's Hospital, Inc.
US Patent
Assay Description
Compounds were assessed in ALK1-6 enzymatic assays. Specifically, compounds were assayed using LANCE® Ultra ULight technology (Perkin Elmer) against ...
US Patent US10017516 (2018)
BindingDB Entry DOI: 10.7270/Q20P12CN
Bone morphogenetic protein receptor type-1A
(Homo sapiens (Human))
BDBM143722
(US10017516, Compound 16 | US9682983, 16)
Show SMILES OCc1ccc2c(ccnc2c1)-c1cnn2cc(cnc12)-c1ccc(cc1)N1CCNCC1
Show InChI InChI=1S/C26H24N6O/c33-17-18-1-6-23-22(7-8-28-25(23)13-18)24-15-30-32-16-20(14-29-26(24)32)19-2-4-21(5-3-19)31-11-9-27-10-12-31/h1-8,13-16,27,33H,9-12,17H2
US Patent
n/an/a 573n/an/an/an/an/an/a
The Brigham and Women's Hospital, Inc.
US Patent
Assay Description
Compounds were assessed in ALK1-6 enzymatic assays. Specifically, compounds were assayed using LANCE® Ultra ULight technology (Perkin Elmer) against ...
US Patent US10017516 (2018)
BindingDB Entry DOI: 10.7270/Q20P12CN
Bone morphogenetic protein receptor type-1B
(Homo sapiens (Human))
BDBM143722
(US10017516, Compound 16 | US9682983, 16)
Show SMILES OCc1ccc2c(ccnc2c1)-c1cnn2cc(cnc12)-c1ccc(cc1)N1CCNCC1
Show InChI InChI=1S/C26H24N6O/c33-17-18-1-6-23-22(7-8-28-25(23)13-18)24-15-30-32-16-20(14-29-26(24)32)19-2-4-21(5-3-19)31-11-9-27-10-12-31/h1-8,13-16,27,33H,9-12,17H2
US Patent
n/an/a 424n/an/an/an/a7.5n/a
The Brigham and Women's Hospital, Inc.; Dept. of Health and Human Services, National Institutes of Health
US Patent
Assay Description
Specifically, compounds were assayed using LANCE® Ultra ULight¿ technology (Perkin Elmer) against human ALK1-6 enzymes (ALK1: Life Technologies, ALK2...
US Patent US9682983 (2017)
BindingDB Entry DOI: 10.7270/Q28S4N3R