BDBM143895 US8969325, 96
SMILES: Cn1c2cccc(NC(=O)N[C@@H]3CCc4cc(Cl)ccc34)c2ccc1=O
InChI Key: InChIKey=PTGQJZXOHXTHSR-QGZVFWFLSA-N
Data: 1 IC50
Activity Spreadsheet -- Enzyme Inhibition Constant Data from BindingDB
Found 1 hit for monomerid = 143895
Trg + Lig
Ki
nM
ΔG°
kcal/mole
IC50
nM
Kd
nM
EC50/IC50
nM
koff
s-1
kon
M-1s-1
pHTemp
°C
Transient receptor potential cation channel subfamily V member 1
(Homo sapiens (Human))
BDBM143895
(US8969325, 96)
Show SMILES Cn1c2cccc(NC(=O)N[C@@H]3CCc4cc(Cl)ccc34)c2ccc1=O
Show InChI InChI=1S/C20H18ClN3O2/c1-24-18-4-2-3-16(15(18)8-10-19(24)25)22-20(26)23-17-9-5-12-11-13(21)6-7-14(12)17/h2-4,6-8,10-11,17H,5,9H2,1H3,(H2,22,23,26)/t17-/m1/s1
Reactome pathway
US Patent
n/an/a 8n/an/an/an/an/an/a
AbbVie Inc.
US Patent
Assay Description
The cDNA for human TRPV1 (hTRPV1) was isolated by reverse transcriptase-polymerase chain reaction (RT-PCR) from human small intestine poly A+ RNA sup...
US Patent US8969325 (2015)
BindingDB Entry DOI: 10.7270/Q29P30BX