BDBM144431 US8969394, 2
SMILES: CC(NC(=O)c1sc(Cl)cc1Cc1cccc(Cl)c1)c1ccc(cc1)-c1nn[nH]n1
InChI Key:
Data: 1 KI
Activity Spreadsheet -- Enzyme Inhibition Constant Data from BindingDB
Found 1 hit for monomerid = 144431
Trg + Lig
Ki
nM
ΔG°
kcal/mole
IC50
nM
Kd
nM
EC50/IC50
nM
koff
s-1
kon
M-1s-1
pHTemp
°C
Prostaglandin E2 receptor EP4 subtype
(Homo sapiens (Human))
BDBM144431
(US8969394, 2)
Show SMILES CC(NC(=O)c1sc(Cl)cc1Cc1cccc(Cl)c1)c1ccc(cc1)-c1nn[nH]n1
Reactome pathway
US Patent
2.60 -11.7n/an/an/an/an/a6.025
Merck Frosst Canada Ltd.
US Patent
Assay Description
Transfected HEK 293(ebna) cells are maintained in culture, harvested and membranes are prepared by differential centrifugation, following lysis of th...
US Patent US8969394 (2015)
BindingDB Entry DOI: 10.7270/Q24X56H8