BDBM144457 US8969568, 8
SMILES: COc1cc(cc(OC)c1Cl)-c1cc2ncccc2c(O[C@H](C)[C@H]2CNC(=O)C2)n1
InChI Key: InChIKey=WSJVSJFIHUYMFY-TZMCWYRMSA-N
Data: 1 IC50
Activity Spreadsheet -- Enzyme Inhibition Constant Data from BindingDB
Found 1 hit for monomerid = 144457
Trg + Lig
Ki
nM
ΔG°
kcal/mole
IC50
nM
Kd
nM
EC50/IC50
nM
koff
s-1
kon
M-1s-1
pHTemp
°C
Tyrosine-protein kinase SYK
(Homo sapiens (Human))
BDBM144457
(US8969568, 8)
Show SMILES COc1cc(cc(OC)c1Cl)-c1cc2ncccc2c(O[C@H](C)[C@H]2CNC(=O)C2)n1 |r|
Show InChI InChI=1S/C22H22ClN3O4/c1-12(14-9-20(27)25-11-14)30-22-15-5-4-6-24-17(15)10-16(26-22)13-7-18(28-2)21(23)19(8-13)29-3/h4-8,10,12,14H,9,11H2,1-3H3,(H,25,27)/t12-,14-/m1/s1
NCI pathway
Reactome pathway
US Patent
n/an/a 3n/an/an/an/an/an/a
Boehringer Ingelheim Pharma GmbH & Co. KG
US Patent
Assay Description
Recombinant human Syk (amino acids 342-635) was expressed as a fusion protein with an N-terminal GST tag, affinity-purified and deep-frozen at a conc...
US Patent US8969568 (2015)
BindingDB Entry DOI: 10.7270/Q2154FRD