BDBM144532 US8969568, 85
SMILES: COc1ccc(cc1OC)-c1cc2ncccc2c(O[C@H](C)[C@H]2CNC(=O)C2)n1
InChI Key: InChIKey=RPYMEOCZLCXVGD-UKRRQHHQSA-N
Data: 1 IC50
Activity Spreadsheet -- Enzyme Inhibition Constant Data from BindingDB
Found 1 hit for monomerid = 144532
Trg + Lig
Ki
nM
ΔG°
kcal/mole
IC50
nM
Kd
nM
EC50/IC50
nM
koff
s-1
kon
M-1s-1
pHTemp
°C
Tyrosine-protein kinase SYK
(Homo sapiens (Human))
BDBM144532
(US8969568, 85)
Show SMILES COc1ccc(cc1OC)-c1cc2ncccc2c(O[C@H](C)[C@H]2CNC(=O)C2)n1 |r|
Show InChI InChI=1S/C22H23N3O4/c1-13(15-10-21(26)24-12-15)29-22-16-5-4-8-23-18(16)11-17(25-22)14-6-7-19(27-2)20(9-14)28-3/h4-9,11,13,15H,10,12H2,1-3H3,(H,24,26)/t13-,15-/m1/s1
NCI pathway
Reactome pathway
US Patent
n/an/a 0.100n/an/an/an/an/an/a
Boehringer Ingelheim Pharma GmbH & Co. KG
US Patent
Assay Description
Recombinant human Syk (amino acids 342-635) was expressed as a fusion protein with an N-terminal GST tag, affinity-purified and deep-frozen at a conc...
US Patent US8969568 (2015)
BindingDB Entry DOI: 10.7270/Q2154FRD