null
SMILES: CCCC(Oc1nc(cc2ncccc12)-c1ccc(OC)c(OC)c1)[C@H]1CNC(=O)C1
InChI Key: InChIKey=HSCHICQAZGKSML-QRIPLOBPSA-N
Activity Spreadsheet -- Enzyme Inhibition Constant Data from BindingDB
Found 1 hit for monomerid = 144545
Trg + Lig
Ki
nM
ΔG°
kcal/mole
IC50
nM
Kd
nM
EC50/IC50
nM
koff
s-1
kon
M-1s-1
pHTemp
°C
Tyrosine-protein kinase SYK
(Homo sapiens (Human))
BDBM144545
(US8969568, 98)
Show SMILES CCCC(Oc1nc(cc2ncccc12)-c1ccc(OC)c(OC)c1)[C@H]1CNC(=O)C1 |r|
Show InChI InChI=1S/C24H27N3O4/c1-4-6-20(16-12-23(28)26-14-16)31-24-17-7-5-10-25-19(17)13-18(27-24)15-8-9-21(29-2)22(11-15)30-3/h5,7-11,13,16,20H,4,6,12,14H2,1-3H3,(H,26,28)/t16-,20?/m1/s1
NCI pathway
Reactome pathway
US Patent
n/an/a 1.70n/an/an/an/an/an/a
Boehringer Ingelheim Pharma GmbH & Co. KG
US Patent
Assay Description
Recombinant human Syk (amino acids 342-635) was expressed as a fusion protein with an N-terminal GST tag, affinity-purified and deep-frozen at a conc...
US Patent US8969568 (2015)
BindingDB Entry DOI: 10.7270/Q2154FRD