BDBM145011 US8952157, 198::US9303025, 198
SMILES: CN1CCC(O)(CNc2ccc(cc2[N+]([O-])=O)S(=O)(=O)NC(=O)c2ccc(cc2Oc2cccc(F)c2)N2CCN(CC3=C(CC(C)(C)CC3)c3ccc(Cl)cc3)CC2)CC1
InChI Key: InChIKey=XCBUOQITMXHLNG-UHFFFAOYSA-N
Data: 2 KI
Activity Spreadsheet -- Enzyme Inhibition Constant Data from BindingDB
Found 2 hits for monomerid = 145011
Trg + Lig
Ki
nM
ΔG°
kcal/mole
IC50
nM
Kd
nM
EC50/IC50
nM
koff
s-1
kon
M-1s-1
pHTemp
°C
Apoptosis regulator Bcl-2
(Homo sapiens (Human))
BDBM145011
(US8952157, 198 | US9303025, 198)
Show SMILES CN1CCC(O)(CNc2ccc(cc2[N+]([O-])=O)S(=O)(=O)NC(=O)c2ccc(cc2Oc2cccc(F)c2)N2CCN(CC3=C(CC(C)(C)CC3)c3ccc(Cl)cc3)CC2)CC1 |t:45|
Show InChI InChI=1S/C45H52ClFN6O7S/c1-44(2)16-15-32(39(28-44)31-7-9-33(46)10-8-31)29-51-21-23-52(24-22-51)35-11-13-38(42(26-35)60-36-6-4-5-34(47)25-36)43(54)49-61(58,59)37-12-14-40(41(27-37)53(56)57)48-30-45(55)17-19-50(3)20-18-45/h4-14,25-27,48,55H,15-24,28-30H2,1-3H3,(H,49,54)
US Patent
<0.0100<-15.0n/an/an/an/an/an/a25
AbbVie Inc.
US Patent
Assay Description
Representative compounds were serially diluted in dimethyl sulfoxide (DMSO) starting at 50 μM (2× starting concentration; 10% DMSO) and 10 μ...
US Patent US9303025 (2016)
BindingDB Entry DOI: 10.7270/Q2XD10JP
Apoptosis regulator Bcl-2
(Homo sapiens (Human))
BDBM145011
(US8952157, 198 | US9303025, 198)
Show SMILES CN1CCC(O)(CNc2ccc(cc2[N+]([O-])=O)S(=O)(=O)NC(=O)c2ccc(cc2Oc2cccc(F)c2)N2CCN(CC3=C(CC(C)(C)CC3)c3ccc(Cl)cc3)CC2)CC1 |t:45|
Show InChI InChI=1S/C45H52ClFN6O7S/c1-44(2)16-15-32(39(28-44)31-7-9-33(46)10-8-31)29-51-21-23-52(24-22-51)35-11-13-38(42(26-35)60-36-6-4-5-34(47)25-36)43(54)49-61(58,59)37-12-14-40(41(27-37)53(56)57)48-30-45(55)17-19-50(3)20-18-45/h4-14,25-27,48,55H,15-24,28-30H2,1-3H3,(H,49,54)
US Patent
<0.0100<-15.0n/an/an/an/an/an/a25
AbbVie Inc.; The Walter and Eliza Hall Institute of Medical Research
US Patent
Assay Description
Representative compounds were serially diluted in dimethyl sulfoxide (DMSO) starting at 50 uM (2x starting concentration; 10% DMSO) and 10 uL were tr...
US Patent US8952157 (2015)
BindingDB Entry DOI: 10.7270/Q2QN65G9