BDBM145257 US8952169, 36::US9771376, Example 36
SMILES: CS(=O)(=O)NC(=O)c1cc(Cl)c(OCCC2CCCCC2)cc1F
InChI Key: InChIKey=PNQHUEIYIAWMIZ-UHFFFAOYSA-N
Data: 3 IC50
Activity Spreadsheet -- Enzyme Inhibition Constant Data from BindingDB
Found 3 hits for monomerid = 145257
Trg + Lig
Ki
nM
ΔG°
kcal/mole
IC50
nM
Kd
nM
EC50/IC50
nM
koff
s-1
kon
M-1s-1
pHTemp
°C
Sodium channel protein type 9 subunit alpha
(Homo sapiens (Human))
BDBM145257
(US8952169, 36 | US9771376, Example 36)
Show SMILES CS(=O)(=O)NC(=O)c1cc(Cl)c(OCCC2CCCCC2)cc1F
Show InChI InChI=1S/C16H21ClFNO4S/c1-24(21,22)19-16(20)12-9-13(17)15(10-14(12)18)23-8-7-11-5-3-2-4-6-11/h9-11H,2-8H2,1H3,(H,19,20)
US Patent
n/an/a 120n/an/an/an/a7.425
Xenon Pharmaceuticals Inc.; Genentech, Inc.
US Patent
Assay Description
Radioligand Binding Studies: Saturation experiments. A representative compound of formula (I) was tritiated. Three tritiums were incorporated in plac...
US Patent US8952169 (2015)
BindingDB Entry DOI: 10.7270/Q2M04445
Sodium channel protein type 9 subunit alpha
(Homo sapiens (Human))
BDBM145257
(US8952169, 36 | US9771376, Example 36)
Show SMILES CS(=O)(=O)NC(=O)c1cc(Cl)c(OCCC2CCCCC2)cc1F
Show InChI InChI=1S/C16H21ClFNO4S/c1-24(21,22)19-16(20)12-9-13(17)15(10-14(12)18)23-8-7-11-5-3-2-4-6-11/h9-11H,2-8H2,1H3,(H,19,20)
US Patent
n/an/a 7.70n/an/an/an/an/an/a
GENENTECH, INC.; XENON PHARMACEUTICALS INC.
US Patent
Assay Description
The following patch voltage clamp electrophysiology studies were performed on representative compounds of the invention using human embryonic kidney ...
US Patent US9771376 (2017)
BindingDB Entry DOI: 10.7270/Q2W0983R
Sodium channel protein type 9 subunit alpha
(Homo sapiens (Human))
BDBM145257
(US8952169, 36 | US9771376, Example 36)
Show SMILES CS(=O)(=O)NC(=O)c1cc(Cl)c(OCCC2CCCCC2)cc1F
Show InChI InChI=1S/C16H21ClFNO4S/c1-24(21,22)19-16(20)12-9-13(17)15(10-14(12)18)23-8-7-11-5-3-2-4-6-11/h9-11H,2-8H2,1H3,(H,19,20)
US Patent
n/an/a 7.70n/an/an/an/an/a37
Xenon Pharmaceuticals Inc.; Genentech, Inc.
US Patent
Assay Description
Patch voltage clamp electrophysiology allows for the direct measurement and quantification of block of voltage-gated sodium channels (NaV's), and all...
US Patent US8952169 (2015)
BindingDB Entry DOI: 10.7270/Q2M04445