BDBM145384 US8952169, 163
SMILES: CCS(=O)(=O)NC(=O)c1cc(C2CC2)c(OCC23CC4CC(CC(C4)C2)C3)cc1F
InChI Key: InChIKey=BQZLLEQGTIRZCM-UHFFFAOYSA-N
Data: 1 IC50
Activity Spreadsheet -- Enzyme Inhibition Constant Data from BindingDB
Found 1 hit for monomerid = 145384
Trg + Lig
Ki
nM
ΔG°
kcal/mole
IC50
nM
Kd
nM
EC50/IC50
nM
koff
s-1
kon
M-1s-1
pHTemp
°C
Sodium channel protein type 9 subunit alpha
(Homo sapiens (Human))
BDBM145384
(US8952169, 163)
Show SMILES CCS(=O)(=O)NC(=O)c1cc(C2CC2)c(OCC23CC4CC(CC(C4)C2)C3)cc1F |TLB:26:17:24:20.21.22,THB:16:17:24:20.21.22,26:21:24:17.25.18,25:17:20:24.23.22,25:23:20:17.26.18|
Show InChI InChI=1S/C23H30FNO4S/c1-2-30(27,28)25-22(26)19-8-18(17-3-4-17)21(9-20(19)24)29-13-23-10-14-5-15(11-23)7-16(6-14)12-23/h8-9,14-17H,2-7,10-13H2,1H3,(H,25,26)
US Patent
n/an/a 1n/an/an/an/a7.425
Xenon Pharmaceuticals Inc.; Genentech, Inc.
US Patent
Assay Description
Radioligand Binding Studies: Saturation experiments. A representative compound of formula (I) was tritiated. Three tritiums were incorporated in plac...
US Patent US8952169 (2015)
BindingDB Entry DOI: 10.7270/Q2M04445