BDBM14562 N-[(4-carbamimidoylphenyl)methyl]-2-{5-chloro-6-methyl-2-oxo-3-[(2-phenylethyl)amino]-1,2-dihydropyrazin-1-yl}acetamide::Pyrazinone Analog 30a
SMILES: Cc1c(Cl)nc(NCCc2ccccc2)c(=O)n1CC(=O)NCc1ccc(cc1)C(N)=N
InChI Key: InChIKey=VJQFUBOLPKNJHK-UHFFFAOYSA-N
Data: 2 IC50
Activity Spreadsheet -- Enzyme Inhibition Constant Data from BindingDB
Found 2 hits for monomerid = 14562
Trg + Lig
Ki
nM
ΔG°
kcal/mole
IC50
nM
Kd
nM
EC50/IC50
nM
koff
s-1
kon
M-1s-1
pHTemp
°C
Coagulation factor VII
(Homo sapiens (Human))
BDBM14562
(N-[(4-carbamimidoylphenyl)methyl]-2-{5-chloro-6-me...)
Show SMILES Cc1c(Cl)nc(NCCc2ccccc2)c(=O)n1CC(=O)NCc1ccc(cc1)C(N)=N
Show InChI InChI=1S/C23H25ClN6O2/c1-15-20(24)29-22(27-12-11-16-5-3-2-4-6-16)23(32)30(15)14-19(31)28-13-17-7-9-18(10-8-17)21(25)26/h2-10H,11-14H2,1H3,(H3,25,26)(H,27,29)(H,28,31)
Reactome pathway
n/an/a 4.28E+3n/an/an/an/an/an/a
Pharmacia Corporation
Assay Description
Recombinant human Factor VIIa and soluble tissue factor were added to a 96-well assay plate containing substrate and inhibitor in reaction buffer. Th...
J Med Chem 46: 4050-62 (2003)
Article DOI: 10.1021/jm030131l
BindingDB Entry DOI: 10.7270/Q2FT8J9M
Prothrombin
(Homo sapiens (Human))
BDBM14562
(N-[(4-carbamimidoylphenyl)methyl]-2-{5-chloro-6-me...)
Show SMILES Cc1c(Cl)nc(NCCc2ccccc2)c(=O)n1CC(=O)NCc1ccc(cc1)C(N)=N
Show InChI InChI=1S/C23H25ClN6O2/c1-15-20(24)29-22(27-12-11-16-5-3-2-4-6-16)23(32)30(15)14-19(31)28-13-17-7-9-18(10-8-17)21(25)26/h2-10H,11-14H2,1H3,(H3,25,26)(H,27,29)(H,28,31)
n/an/a 60n/an/an/an/an/an/a
Pharmacia Corporation
Assay Description
Human thrombin and substrate were added to a 96-well assay plate containing inhibitor in reaction buffer. The rate of hydrolysis of the substrate was...
J Med Chem 46: 4050-62 (2003)
Article DOI: 10.1021/jm030131l
BindingDB Entry DOI: 10.7270/Q2FT8J9M