BDBM14679 2-formyl-6-methoxyphenoxyphosphonic acid::2-formyl-6-methoxyphenyl dihydrogen phosphate::CHEMBL25186::Fragment 9::RU78300
SMILES: COc1cccc(C=O)c1OP(O)(O)=O
InChI Key: InChIKey=CGEZBCISRKFHLZ-UHFFFAOYSA-N
Data: 4 IC50
PDB links: 1 PDB ID matches this monomer.
Activity Spreadsheet -- Enzyme Inhibition Constant Data from BindingDB
Found 4 hits for monomerid = 14679
Trg + Lig
Ki
nM
ΔG°
kcal/mole
IC50
nM
Kd
nM
EC50/IC50
nM
koff
s-1
kon
M-1s-1
pHTemp
°C
Proto-oncogene tyrosine-protein kinase Src (aa 145-252)
(Homo sapiens (Human))
BDBM14679
(2-formyl-6-methoxyphenoxyphosphonic acid | 2-formy...)
Show SMILES COc1cccc(C=O)c1OP(O)(O)=O
Show InChI InChI=1S/C8H9O6P/c1-13-7-4-2-3-6(5-9)8(7)14-15(10,11)12/h2-5H,1H3,(H2,10,11,12)
n/an/a 9.00E+5n/an/an/an/a7.422
Aventis Pharma
Assay Description
SPA uses 125I as energy donor and scintillant-coated beads as energy acceptor. The labeled ligand is captured by the biotinylated Src-SH2 protein imm...
J Med Chem 46: 5184-95 (2003)
Article DOI: 10.1021/jm020970s
BindingDB Entry DOI: 10.7270/Q2XW4H14
3D
3D Structure (crystal)
Proto-oncogene tyrosine-protein kinase Src
(Homo sapiens (Human))
BDBM14679
(2-formyl-6-methoxyphenoxyphosphonic acid | 2-formy...)
Show SMILES COc1cccc(C=O)c1OP(O)(O)=O
Show InChI InChI=1S/C8H9O6P/c1-13-7-4-2-3-6(5-9)8(7)14-15(10,11)12/h2-5H,1H3,(H2,10,11,12)
n/an/a 9.00E+5n/an/an/an/an/an/a
Aventis Pharma
Curated by ChEMBL
Assay Description
The compound was evaluated for its binding affinity towards phosphotyrosine binding pocket of Src protein tryrosine kinase SH2 domain
Bioorg Med Chem Lett 12: 1295-8 (2002)
BindingDB Entry DOI: 10.7270/Q2959GW0
3D
3D Structure (crystal)
Proto-oncogene tyrosine-protein kinase Src
(Homo sapiens (Human))
BDBM14679
(2-formyl-6-methoxyphenoxyphosphonic acid | 2-formy...)
Show SMILES COc1cccc(C=O)c1OP(O)(O)=O
Show InChI InChI=1S/C8H9O6P/c1-13-7-4-2-3-6(5-9)8(7)14-15(10,11)12/h2-5H,1H3,(H2,10,11,12)
n/an/a 9.00E+5n/an/an/an/an/an/a
Aventis
Curated by ChEMBL
Assay Description
Binding affinity for Src protein tryrosine kinase SH2 domainusing scintillation proximity binding assay (SPA)
J Med Chem 45: 2379-87 (2002)
BindingDB Entry DOI: 10.7270/Q21J992G
3D
3D Structure (crystal)
Proto-oncogene tyrosine-protein kinase Src
(Homo sapiens (Human))
BDBM14679
(2-formyl-6-methoxyphenoxyphosphonic acid | 2-formy...)
Show SMILES COc1cccc(C=O)c1OP(O)(O)=O
Show InChI InChI=1S/C8H9O6P/c1-13-7-4-2-3-6(5-9)8(7)14-15(10,11)12/h2-5H,1H3,(H2,10,11,12)
n/an/a 9.50E+4n/an/an/an/an/an/a
Aventis
Curated by ChEMBL
Assay Description
Binding affinity for Src protein tryrosine kinase SH2 domainusing scintillation proximity binding assay (SPA)
J Med Chem 45: 2379-87 (2002)
BindingDB Entry DOI: 10.7270/Q21J992G
3D
3D Structure (crystal)