BDBM14684 2-cyanoquinolin-8-yl dihydrogen phosphate::Fragment 14::RU79072::[(2-cyanoquinolin-8-yl)oxy]phosphonic acid
SMILES: OP(O)(=O)Oc1cccc2ccc(nc12)C#N
InChI Key: InChIKey=NQLPTOOPFMPCHQ-UHFFFAOYSA-N
Data: 1 IC50
PDB links: 1 PDB ID matches this monomer.
Activity Spreadsheet -- Enzyme Inhibition Constant Data from BindingDB
Found 1 hit for monomerid = 14684
Trg + Lig
Ki
nM
ΔG°
kcal/mole
IC50
nM
Kd
nM
EC50/IC50
nM
koff
s-1
kon
M-1s-1
pHTemp
°C
Proto-oncogene tyrosine-protein kinase Src (aa 145-252)
(Homo sapiens (Human))
BDBM14684
(2-cyanoquinolin-8-yl dihydrogen phosphate | Fragme...)
Show SMILES OP(O)(=O)Oc1cccc2ccc(nc12)C#N
Show InChI InChI=1S/C10H7N2O4P/c11-6-8-5-4-7-2-1-3-9(10(7)12-8)16-17(13,14)15/h1-5H,(H2,13,14,15)
n/an/a 3.60E+6n/an/an/an/a7.422
Aventis Pharma
Assay Description
SPA uses 125I as energy donor and scintillant-coated beads as energy acceptor. The labeled ligand is captured by the biotinylated Src-SH2 protein imm...
J Med Chem 46: 5184-95 (2003)
Article DOI: 10.1021/jm020970s
BindingDB Entry DOI: 10.7270/Q2XW4H14
3D
3D Structure (crystal)