BDBM14688 (benzyloxy)(2-formylphenoxy)phosphinic acid::Fragment 18::PASBN::benzyl 2-formylphenyl hydrogen phosphate
SMILES: OP(=O)(OCc1ccccc1)Oc1ccccc1C=O
InChI Key: InChIKey=PWDTUFYQEUEVQD-UHFFFAOYSA-N
Data: 1 IC50
PDB links: 1 PDB ID matches this monomer.
Activity Spreadsheet -- Enzyme Inhibition Constant Data from BindingDB
Found 1 hit for monomerid = 14688
Trg + Lig
Ki
nM
ΔG°
kcal/mole
IC50
nM
Kd
nM
EC50/IC50
nM
koff
s-1
kon
M-1s-1
pHTemp
°C
Proto-oncogene tyrosine-protein kinase Src (aa 145-252)
(Homo sapiens (Human))
BDBM14688
((benzyloxy)(2-formylphenoxy)phosphinic acid | Frag...)
Show SMILES OP(=O)(OCc1ccccc1)Oc1ccccc1C=O
Show InChI InChI=1S/C14H13O5P/c15-10-13-8-4-5-9-14(13)19-20(16,17)18-11-12-6-2-1-3-7-12/h1-10H,11H2,(H,16,17)
n/an/a 1.20E+6n/an/an/an/an/an/a
Aventis Pharma
Assay Description
SPA uses 125I as energy donor and scintillant-coated beads as energy acceptor. The labeled ligand is captured by the biotinylated Src-SH2 protein imm...
J Med Chem 46: 5184-95 (2003)
Article DOI: 10.1021/jm020970s
BindingDB Entry DOI: 10.7270/Q2XW4H14
3D
3D Structure (crystal)