BDBM14690 2-{2-carboxy-4-[(2S)-2-acetamido-2-{[(3S)-2-oxo-1-[(4-phenylphenyl)methyl]azepan-3-yl]carbamoyl}ethyl]phenyl}propanedioic acid::CHEMBL421518::Inhibitor 2::RU85052::{4-[(2S)-2-(acetylamino)-3-{[(3S)-1-(biphenyl-4-ylmethyl)-2-oxoazepan-3-yl]amino}-3-oxopropyl]-2-carboxyphenyl}propanedioic acid
SMILES: CC(=O)N[C@@H](Cc1ccc(C(C(O)=O)C(O)=O)c(c1)C(O)=O)C(=O)N[C@H]1CCCCN(Cc2ccc(cc2)-c2ccccc2)C1=O
InChI Key: InChIKey=CGOGPQNYHFBUEF-NSOVKSMOSA-N
Data: 3 IC50
PDB links: 1 PDB ID matches this monomer. 1 PDB ID contains this monomer as substructures. 1 PDB ID contains inhibitors having a similarity of 90% to this monomer.
Activity Spreadsheet -- Enzyme Inhibition Constant Data from BindingDB
Found 3 hits for monomerid = 14690
Trg + Lig
Ki
nM
ΔG°
kcal/mole
IC50
nM
Kd
nM
EC50/IC50
nM
koff
s-1
kon
M-1s-1
pHTemp
°C
Proto-oncogene tyrosine-protein kinase Src [145-252]
(Homo sapiens (Human))
BDBM14690
(2-{2-carboxy-4-[(2S)-2-acetamido-2-{[(3S)-2-oxo-1-...)
Show SMILES CC(=O)N[C@@H](Cc1ccc(C(C(O)=O)C(O)=O)c(c1)C(O)=O)C(=O)N[C@H]1CCCCN(Cc2ccc(cc2)-c2ccccc2)C1=O |r|
Show InChI InChI=1S/C34H35N3O9/c1-20(38)35-28(18-22-12-15-25(26(17-22)32(41)42)29(33(43)44)34(45)46)30(39)36-27-9-5-6-16-37(31(27)40)19-21-10-13-24(14-11-21)23-7-3-2-4-8-23/h2-4,7-8,10-15,17,27-29H,5-6,9,16,18-19H2,1H3,(H,35,38)(H,36,39)(H,41,42)(H,43,44)(H,45,46)/t27-,28-/m0/s1
n/an/a 3n/an/an/an/an/an/a
Aventis Pharma
Assay Description
SPA uses 125I as energy donor and scintillant-coated beads as energy acceptor. The labeled ligand is captured by the biotinylated Src-SH2 protein imm...
J Med Chem 46: 5184-95 (2003)
Article DOI: 10.1021/jm020970s
BindingDB Entry DOI: 10.7270/Q2XW4H14
3D
3D Structure (crystal)
Proto-oncogene tyrosine-protein kinase Src
(Homo sapiens (Human))
BDBM14690
(2-{2-carboxy-4-[(2S)-2-acetamido-2-{[(3S)-2-oxo-1-...)
Show SMILES CC(=O)N[C@@H](Cc1ccc(C(C(O)=O)C(O)=O)c(c1)C(O)=O)C(=O)N[C@H]1CCCCN(Cc2ccc(cc2)-c2ccccc2)C1=O |r|
Show InChI InChI=1S/C34H35N3O9/c1-20(38)35-28(18-22-12-15-25(26(17-22)32(41)42)29(33(43)44)34(45)46)30(39)36-27-9-5-6-16-37(31(27)40)19-21-10-13-24(14-11-21)23-7-3-2-4-8-23/h2-4,7-8,10-15,17,27-29H,5-6,9,16,18-19H2,1H3,(H,35,38)(H,36,39)(H,41,42)(H,43,44)(H,45,46)/t27-,28-/m0/s1
n/an/a 3n/an/an/an/an/an/a
Aventis Pharma
Curated by ChEMBL
Assay Description
Inhibitory concentration against SH2 domain of human p60 Src tyrosine kinase
J Med Chem 45: 2915-22 (2002)
BindingDB Entry DOI: 10.7270/Q2ZW1MNM
3D
3D Structure (crystal)
Proto-oncogene tyrosine-protein kinase Src
(Homo sapiens (Human))
BDBM14690
(2-{2-carboxy-4-[(2S)-2-acetamido-2-{[(3S)-2-oxo-1-...)
Show SMILES CC(=O)N[C@@H](Cc1ccc(C(C(O)=O)C(O)=O)c(c1)C(O)=O)C(=O)N[C@H]1CCCCN(Cc2ccc(cc2)-c2ccccc2)C1=O |r|
Show InChI InChI=1S/C34H35N3O9/c1-20(38)35-28(18-22-12-15-25(26(17-22)32(41)42)29(33(43)44)34(45)46)30(39)36-27-9-5-6-16-37(31(27)40)19-21-10-13-24(14-11-21)23-7-3-2-4-8-23/h2-4,7-8,10-15,17,27-29H,5-6,9,16,18-19H2,1H3,(H,35,38)(H,36,39)(H,41,42)(H,43,44)(H,45,46)/t27-,28-/m0/s1
n/an/a 5n/an/an/an/an/an/a
Aventis
Curated by ChEMBL
Assay Description
Binding affinity towards Src protein tryrosine kinase SH2 domain using scintillation proximity binding assay (SPA)
J Med Chem 45: 2379-87 (2002)
BindingDB Entry DOI: 10.7270/Q21J992G
3D
3D Structure (crystal)