BDBM147026 US8957074, 66
SMILES: CN(C)C(=O)c1cc2cnc(Nc3ccc(cn3)C(=O)N3CC4CCC(C3)N4)nc2n1C1CCCCC1
InChI Key: InChIKey=PGOVADJXEQVJAD-UHFFFAOYSA-N
Data: 2 IC50
Activity Spreadsheet -- Enzyme Inhibition Constant Data from BindingDB
Found 2 hits for monomerid = 147026
Trg + Lig
Ki
nM
ΔG°
kcal/mole
IC50
nM
Kd
nM
EC50/IC50
nM
koff
s-1
kon
M-1s-1
pHTemp
°C
Cyclin-dependent kinase 1
(Homo sapiens (Human))
BDBM147026
(US8957074, 66)
Show SMILES CN(C)C(=O)c1cc2cnc(Nc3ccc(cn3)C(=O)N3CC4CCC(C3)N4)nc2n1C1CCCCC1
Show InChI InChI=1S/C27H34N8O2/c1-33(2)26(37)22-12-18-14-29-27(32-24(18)35(22)21-6-4-3-5-7-21)31-23-11-8-17(13-28-23)25(36)34-15-19-9-10-20(16-34)30-19/h8,11-14,19-21,30H,3-7,9-10,15-16H2,1-2H3,(H,28,29,31,32)
Reactome pathway
US Patent
n/an/a>1.50E+4n/an/an/an/an/a25
Novartis AG
US Patent
Assay Description
A 384-well microtiter IMAP-FP (Molecular Devices Trade Mark Technology) endpoint assay was used for CDK1/cyclin B kinase activity measurements. The s...
US Patent US8957074 (2015)
BindingDB Entry DOI: 10.7270/Q2K0730S
Cyclin-dependent kinase 4
(Homo sapiens (Human))
BDBM147026
(US8957074, 66)
Show SMILES CN(C)C(=O)c1cc2cnc(Nc3ccc(cn3)C(=O)N3CC4CCC(C3)N4)nc2n1C1CCCCC1
Show InChI InChI=1S/C27H34N8O2/c1-33(2)26(37)22-12-18-14-29-27(32-24(18)35(22)21-6-4-3-5-7-21)31-23-11-8-17(13-28-23)25(36)34-15-19-9-10-20(16-34)30-19/h8,11-14,19-21,30H,3-7,9-10,15-16H2,1-2H3,(H,28,29,31,32)
NCI pathway
Reactome pathway
US Patent
n/an/a 5.5n/an/an/an/a7.522
Novartis AG
US Patent
Assay Description
An assay for monitoring CDK4/cyclin D1-catalyzed phosphorylation of pRb at the Ser780 site was performed using TR-FRET in a 384-well format, and was ...
US Patent US8957074 (2015)
BindingDB Entry DOI: 10.7270/Q2K0730S