BDBM147041 US8957074, 83
SMILES: CN(C)C(=O)c1cc2cnc(Nc3ccc(cn3)N3C[C@H]4CNC[C@H]4C3=O)nc2n1C1CCCCCC1
InChI Key: InChIKey=VLUJHZWOUOZYQQ-WIYYLYMNSA-N
Data: 2 IC50
Activity Spreadsheet -- Enzyme Inhibition Constant Data from BindingDB
Found 2 hits for monomerid = 147041
Trg + Lig
Ki
nM
ΔG°
kcal/mole
IC50
nM
Kd
nM
EC50/IC50
nM
koff
s-1
kon
M-1s-1
pHTemp
°C
Cyclin-dependent kinase 1
(Homo sapiens (Human))
BDBM147041
(US8957074, 83)
Show SMILES CN(C)C(=O)c1cc2cnc(Nc3ccc(cn3)N3C[C@H]4CNC[C@H]4C3=O)nc2n1C1CCCCCC1 |r|
Show InChI InChI=1S/C27H34N8O2/c1-33(2)26(37)22-11-17-13-30-27(32-24(17)35(22)19-7-5-3-4-6-8-19)31-23-10-9-20(14-29-23)34-16-18-12-28-15-21(18)25(34)36/h9-11,13-14,18-19,21,28H,3-8,12,15-16H2,1-2H3,(H,29,30,31,32)/t18-,21-/m1/s1
Reactome pathway
US Patent
n/an/a 5.32E+3n/an/an/an/an/a25
Novartis AG
US Patent
Assay Description
A 384-well microtiter IMAP-FP (Molecular Devices Trade Mark Technology) endpoint assay was used for CDK1/cyclin B kinase activity measurements. The s...
US Patent US8957074 (2015)
BindingDB Entry DOI: 10.7270/Q2K0730S
Cyclin-dependent kinase 4
(Homo sapiens (Human))
BDBM147041
(US8957074, 83)
Show SMILES CN(C)C(=O)c1cc2cnc(Nc3ccc(cn3)N3C[C@H]4CNC[C@H]4C3=O)nc2n1C1CCCCCC1 |r|
Show InChI InChI=1S/C27H34N8O2/c1-33(2)26(37)22-11-17-13-30-27(32-24(17)35(22)19-7-5-3-4-6-8-19)31-23-10-9-20(14-29-23)34-16-18-12-28-15-21(18)25(34)36/h9-11,13-14,18-19,21,28H,3-8,12,15-16H2,1-2H3,(H,29,30,31,32)/t18-,21-/m1/s1
NCI pathway
Reactome pathway
US Patent
n/an/a 3n/an/an/an/a7.522
Novartis AG
US Patent
Assay Description
An assay for monitoring CDK4/cyclin D1-catalyzed phosphorylation of pRb at the Ser780 site was performed using TR-FRET in a 384-well format, and was ...
US Patent US8957074 (2015)
BindingDB Entry DOI: 10.7270/Q2K0730S