BDBM147091 US8957074, 131
SMILES: CN(C)C(=O)c1cc2cnc(Nc3ccc(cn3)N3CC4CCC(CC3=O)N4)nc2n1C1CCCCC1
InChI Key: InChIKey=KSBSIXFKBIRVML-UHFFFAOYSA-N
Data: 2 IC50
Activity Spreadsheet -- Enzyme Inhibition Constant Data from BindingDB
Found 2 hits for monomerid = 147091
Trg + Lig
Ki
nM
ΔG°
kcal/mole
IC50
nM
Kd
nM
EC50/IC50
nM
koff
s-1
kon
M-1s-1
pHTemp
°C
Cyclin-dependent kinase 1
(Homo sapiens (Human))
BDBM147091
(US8957074, 131)
Show SMILES CN(C)C(=O)c1cc2cnc(Nc3ccc(cn3)N3CC4CCC(CC3=O)N4)nc2n1C1CCCCC1
Show InChI InChI=1S/C27H34N8O2/c1-33(2)26(37)22-12-17-14-29-27(32-25(17)35(22)20-6-4-3-5-7-20)31-23-11-10-21(15-28-23)34-16-19-9-8-18(30-19)13-24(34)36/h10-12,14-15,18-20,30H,3-9,13,16H2,1-2H3,(H,28,29,31,32)
Reactome pathway
US Patent
n/an/a>1.50E+4n/an/an/an/an/a25
Novartis AG
US Patent
Assay Description
A 384-well microtiter IMAP-FP (Molecular Devices Trade Mark Technology) endpoint assay was used for CDK1/cyclin B kinase activity measurements. The s...
US Patent US8957074 (2015)
BindingDB Entry DOI: 10.7270/Q2K0730S
Cyclin-dependent kinase 4
(Homo sapiens (Human))
BDBM147091
(US8957074, 131)
Show SMILES CN(C)C(=O)c1cc2cnc(Nc3ccc(cn3)N3CC4CCC(CC3=O)N4)nc2n1C1CCCCC1
Show InChI InChI=1S/C27H34N8O2/c1-33(2)26(37)22-12-17-14-29-27(32-25(17)35(22)20-6-4-3-5-7-20)31-23-11-10-21(15-28-23)34-16-19-9-8-18(30-19)13-24(34)36/h10-12,14-15,18-20,30H,3-9,13,16H2,1-2H3,(H,28,29,31,32)
NCI pathway
Reactome pathway
US Patent
n/an/a 4n/an/an/an/a7.522
Novartis AG
US Patent
Assay Description
An assay for monitoring CDK4/cyclin D1-catalyzed phosphorylation of pRb at the Ser780 site was performed using TR-FRET in a 384-well format, and was ...
US Patent US8957074 (2015)
BindingDB Entry DOI: 10.7270/Q2K0730S