BDBM14729 1-N-[5-Sulfamoyl-1,3,4-thiadiazol-2-yl-(aminosulfonyl-4-phenyl)]-2-n-propyl-4,6-diphenylpyridinium perchlorate::2,4-diphenyl-6-propyl-1-{4-[(5-sulfamoyl-1,3,4-thiadiazol-2-yl)sulfamoyl]phenyl}-1-pyridin-1-ylium perchlorate::pyridinium-containing sulfonamide analog 14m
SMILES: CCCc1cc(cc(-c2ccccc2)[n+]1-c1ccc(cc1)S(=O)(=O)Nc1nnc(s1)S(N)(=O)=O)-c1ccccc1
InChI Key: InChIKey=NHJGGBOIASKXGY-UHFFFAOYSA-N
Data: 4 KI
Activity Spreadsheet -- Enzyme Inhibition Constant Data from BindingDB
Found 4 hits for monomerid = 14729
Trg + Lig
Ki
nM
ΔG°
kcal/mole
IC50
nM
Kd
nM
EC50/IC50
nM
koff
s-1
kon
M-1s-1
pHTemp
°C
Carbonic anhydrase 2
(Homo sapiens (Human))
BDBM14729
(1-N-[5-Sulfamoyl-1,3,4-thiadiazol-2-yl-(aminosulfo...)
Show SMILES CCCc1cc(cc(-c2ccccc2)[n+]1-c1ccc(cc1)S(=O)(=O)Nc1nnc(s1)S(N)(=O)=O)-c1ccccc1
Show InChI InChI=1S/C28H26N5O4S3/c1-2-9-24-18-22(20-10-5-3-6-11-20)19-26(21-12-7-4-8-13-21)33(24)23-14-16-25(17-15-23)40(36,37)32-27-30-31-28(38-27)39(29,34)35/h3-8,10-19H,2,9H2,1H3,(H,30,32)(H2,29,34,35)/q+1
Reactome pathway
3.90n/an/an/an/an/an/an/an/a
Canadian Institutes of Health Research
Assay Description
Initial rates of 4-nitrophenyl acetate hydrolysis catalyzed by different CA isozymes were monitored spectrophotometrically at 400 nm. A molar absorpt...
J Med Chem 47: 2337-47 (2004)
Article DOI: 10.1021/jm031079w
BindingDB Entry DOI: 10.7270/Q2DV1H4B
Carbonic Anhydrase IV
(Bos taurus (bovine))
BDBM14729
(1-N-[5-Sulfamoyl-1,3,4-thiadiazol-2-yl-(aminosulfo...)
Show SMILES CCCc1cc(cc(-c2ccccc2)[n+]1-c1ccc(cc1)S(=O)(=O)Nc1nnc(s1)S(N)(=O)=O)-c1ccccc1
Show InChI InChI=1S/C28H26N5O4S3/c1-2-9-24-18-22(20-10-5-3-6-11-20)19-26(21-12-7-4-8-13-21)33(24)23-14-16-25(17-15-23)40(36,37)32-27-30-31-28(38-27)39(29,34)35/h3-8,10-19H,2,9H2,1H3,(H,30,32)(H2,29,34,35)/q+1
Reactome pathway
6n/an/an/an/an/an/an/an/a
Canadian Institutes of Health Research
Assay Description
Initial rates of 4-nitrophenyl acetate hydrolysis catalyzed by different CA isozymes were monitored spectrophotometrically at 400 nm. A molar absorpt...
J Med Chem 47: 2337-47 (2004)
Article DOI: 10.1021/jm031079w
BindingDB Entry DOI: 10.7270/Q2DV1H4B
Carbonic anhydrase 1
(Homo sapiens (Human))
BDBM14729
(1-N-[5-Sulfamoyl-1,3,4-thiadiazol-2-yl-(aminosulfo...)
Show SMILES CCCc1cc(cc(-c2ccccc2)[n+]1-c1ccc(cc1)S(=O)(=O)Nc1nnc(s1)S(N)(=O)=O)-c1ccccc1
Show InChI InChI=1S/C28H26N5O4S3/c1-2-9-24-18-22(20-10-5-3-6-11-20)19-26(21-12-7-4-8-13-21)33(24)23-14-16-25(17-15-23)40(36,37)32-27-30-31-28(38-27)39(29,34)35/h3-8,10-19H,2,9H2,1H3,(H,30,32)(H2,29,34,35)/q+1
NCI pathway
Reactome pathway
8 -11.0n/an/an/an/an/a7.525
Canadian Institutes of Health Research
Assay Description
Initial rates of 4-nitrophenyl acetate hydrolysis catalyzed by different CA isozymes were monitored spectrophotometrically at 400 nm. A molar absorpt...
J Med Chem 47: 2337-47 (2004)
Article DOI: 10.1021/jm031079w
BindingDB Entry DOI: 10.7270/Q2DV1H4B
Carbonic anhydrase 9
(Homo sapiens (Human))
BDBM14729
(1-N-[5-Sulfamoyl-1,3,4-thiadiazol-2-yl-(aminosulfo...)
Show SMILES CCCc1cc(cc(-c2ccccc2)[n+]1-c1ccc(cc1)S(=O)(=O)Nc1nnc(s1)S(N)(=O)=O)-c1ccccc1
Show InChI InChI=1S/C28H26N5O4S3/c1-2-9-24-18-22(20-10-5-3-6-11-20)19-26(21-12-7-4-8-13-21)33(24)23-14-16-25(17-15-23)40(36,37)32-27-30-31-28(38-27)39(29,34)35/h3-8,10-19H,2,9H2,1H3,(H,30,32)(H2,29,34,35)/q+1
NCI pathway
Reactome pathway
40n/an/an/an/an/an/an/an/a
Canadian Institutes of Health Research
Assay Description
An Applied Photophysics stopped-flow instrument has been used for assaying the CA-catalyzed CO2 hydration activity. Phenol red has been used as indic...
J Med Chem 47: 2337-47 (2004)
Article DOI: 10.1021/jm031079w
BindingDB Entry DOI: 10.7270/Q2DV1H4B