null
SMILES: C[C@H](NC(=O)c1ccc2n(Cc3ccc(cc3)-c3ccccc3)c(C)c(C)c2c1)c1ccccc1Cl
InChI Key: InChIKey=GILVDKNNBDMSQW-QFIPXVFZSA-N
Activity Spreadsheet -- Enzyme Inhibition Constant Data from BindingDB
Found 1 hit for monomerid = 147327
Trg + Lig
Ki
nM
ΔG°
kcal/mole
IC50
nM
Kd
nM
EC50/IC50
nM
koff
s-1
kon
M-1s-1
pHTemp
°C
Peroxisome proliferator-activated receptor gamma
(Homo sapiens (Human))
BDBM147327
(US8957093, 159)
Show SMILES C[C@H](NC(=O)c1ccc2n(Cc3ccc(cc3)-c3ccccc3)c(C)c(C)c2c1)c1ccccc1Cl |r|
Show InChI InChI=1S/C32H29ClN2O/c1-21-23(3)35(20-24-13-15-26(16-14-24)25-9-5-4-6-10-25)31-18-17-27(19-29(21)31)32(36)34-22(2)28-11-7-8-12-30(28)33/h4-19,22H,20H2,1-3H3,(H,34,36)/t22-/m0/s1
NCI pathway
Reactome pathway
US Patent
n/an/a<1n/an/an/an/an/an/a
The Scripps Research Institute
US Patent
Assay Description
The assay was performed according to manufacturer protocol. A mixture of nM GST-PPARG-LBD, 5 nM Tb-GST-antibody, 5 nM Fluormone Pan-PPAR Green, and s...
US Patent US8957093 (2015)
BindingDB Entry DOI: 10.7270/Q2X63KNR