BDBM148153 US8962612, 8
SMILES: [#7]\[#6](-[#7])=[#7]\[#6](=O)-[#7]-1-[#6]-[#6]-c2cccc(c2-[#6]-1)-c1cc(F)c(F)cc1F
InChI Key: InChIKey=RDEDININJACLDX-UHFFFAOYSA-N
Data: 1 KI
Activity Spreadsheet -- Enzyme Inhibition Constant Data from BindingDB
Found 1 hit for monomerid = 148153
Trg + Lig
Ki
nM
ΔG°
kcal/mole
IC50
nM
Kd
nM
EC50/IC50
nM
koff
s-1
kon
M-1s-1
pHTemp
°C
5-hydroxytryptamine receptor 5A
(Homo sapiens (Human))
BDBM148153
(US8962612, 8)
Show SMILES [#7]\[#6](-[#7])=[#7]\[#6](=O)-[#7]-1-[#6]-[#6]-c2cccc(c2-[#6]-1)-c1cc(F)c(F)cc1F
Show InChI InChI=1S/C17H15F3N4O/c18-13-7-15(20)14(19)6-11(13)10-3-1-2-9-4-5-24(8-12(9)10)17(25)23-16(21)22/h1-3,6-7H,4-5,8H2,(H4,21,22,23,25)
US Patent
3.60 -12.0n/an/an/an/an/a7.437
Astellas Pharma Inc.
US Patent
Assay Description
A test compound and 150 uM of a DMSO solution of 5-carboxamide tryptamine (5-CT) were added to a 96-well plate at 2 ul/well and suspended in the incu...
US Patent US8962612 (2015)
BindingDB Entry DOI: 10.7270/Q24Q7SQP