BDBM148161 US8962612, 61
SMILES: NC(N)=NC(=O)N1CCc2c(Cl)ccc(c2C1)-c1c(F)cncc1F
InChI Key: InChIKey=GPZLWYFUWCDNEF-UHFFFAOYSA-N
Data: 1 KI
Activity Spreadsheet -- Enzyme Inhibition Constant Data from BindingDB
Found 1 hit for monomerid = 148161
Trg + Lig
Ki
nM
ΔG°
kcal/mole
IC50
nM
Kd
nM
EC50/IC50
nM
koff
s-1
kon
M-1s-1
pHTemp
°C
5-hydroxytryptamine receptor 5A
(Homo sapiens (Human))
BDBM148161
(US8962612, 61)
Show SMILES NC(N)=NC(=O)N1CCc2c(Cl)ccc(c2C1)-c1c(F)cncc1F |(6,-.77,;4.67,,;4.67,1.54,;3.33,-.77,;2,,;2,1.54,;.67,-.77,;.67,-2.31,;-.67,-3.08,;-2,-2.31,;-3.33,-3.08,;-3.33,-4.62,;-4.67,-2.31,;-4.67,-.77,;-3.33,,;-2,-.77,;-.67,,;-3.33,1.54,;-4.67,2.31,;-6,1.54,;-4.67,3.85,;-3.33,4.62,;-2,3.85,;-2,2.31,;-.67,1.54,)|
Show InChI InChI=1S/C16H14ClF2N5O/c17-11-2-1-9(14-12(18)5-22-6-13(14)19)10-7-24(4-3-8(10)11)16(25)23-15(20)21/h1-2,5-6H,3-4,7H2,(H4,20,21,23,25)
US Patent
2.5 -12.2n/an/an/an/an/a7.437
Astellas Pharma Inc.
US Patent
Assay Description
A test compound and 150 uM of a DMSO solution of 5-carboxamide tryptamine (5-CT) were added to a 96-well plate at 2 ul/well and suspended in the incu...
US Patent US8962612 (2015)
BindingDB Entry DOI: 10.7270/Q24Q7SQP