BDBM148171 US8962612, 86
SMILES: [#7]\[#6](-[#7])=[#7]\[#6](=O)-[#7]-1-[#6]-c2c(ccc(F)c2C2([#6]-[#6]2)[#6]-1)-c1ccccc1F
InChI Key: InChIKey=NTVDLKUJYXRVBA-UHFFFAOYSA-N
Data: 1 KI
Activity Spreadsheet -- Enzyme Inhibition Constant Data from BindingDB
Found 1 hit for monomerid = 148171
Trg + Lig
Ki
nM
ΔG°
kcal/mole
IC50
nM
Kd
nM
EC50/IC50
nM
koff
s-1
kon
M-1s-1
pHTemp
°C
5-hydroxytryptamine receptor 5A
(Homo sapiens (Human))
BDBM148171
(US8962612, 86)
Show SMILES [#7]\[#6](-[#7])=[#7]\[#6](=O)-[#7]-1-[#6]-c2c(ccc(F)c2C2([#6]-[#6]2)[#6]-1)-c1ccccc1F
Show InChI InChI=1S/C19H18F2N4O/c20-14-4-2-1-3-12(14)11-5-6-15(21)16-13(11)9-25(10-19(16)7-8-19)18(26)24-17(22)23/h1-6H,7-10H2,(H4,22,23,24,26)
US Patent
0.950 -12.8n/an/an/an/an/a7.437
Astellas Pharma Inc.
US Patent
Assay Description
A test compound and 150 uM of a DMSO solution of 5-carboxamide tryptamine (5-CT) were added to a 96-well plate at 2 ul/well and suspended in the incu...
US Patent US8962612 (2015)
BindingDB Entry DOI: 10.7270/Q24Q7SQP