BDBM148173 US8962616, 1
SMILES: NC1=N[C@]2(CO[C@H](C[C@H]2CS1)c1ncco1)c1ccc(F)cc1F
InChI Key: InChIKey=ITDPHYUDGLCWQU-VAHXTSCQSA-N
Data: 11 IC50
Activity Spreadsheet -- Enzyme Inhibition Constant Data from BindingDB
Found 11 hits for monomerid = 148173
Trg + Lig
Ki
nM
ΔG°
kcal/mole
IC50
nM
Kd
nM
EC50/IC50
nM
koff
s-1
kon
M-1s-1
pHTemp
°C
Beta-secretase 1
(Homo sapiens (Human))
BDBM148173
(US8962616, 1)
Show SMILES NC1=N[C@]2(CO[C@H](C[C@H]2CS1)c1ncco1)c1ccc(F)cc1F |r,t:1|
Show InChI InChI=1S/C16H15F2N3O2S/c17-10-1-2-11(12(18)6-10)16-8-23-13(14-20-3-4-22-14)5-9(16)7-24-15(19)21-16/h1-4,6,9,13H,5,7-8H2,(H2,19,21)/t9-,13+,16-/m0/s1
US Patent
n/an/a 511n/an/an/an/an/an/a
Pfizer Inc.
US Patent
Assay Description
Beta-secretase (BACE) is one of the enzymes involved in the generation of the amyloid beta peptide found in the amyloid plaques of Alzheimer's Diseas...
US Patent US8962616 (2015)
BindingDB Entry DOI: 10.7270/Q20Z7216
Beta-secretase 2
(Homo sapiens (Human))
BDBM148173
(US8962616, 1)
Show SMILES NC1=N[C@]2(CO[C@H](C[C@H]2CS1)c1ncco1)c1ccc(F)cc1F |r,t:1|
Show InChI InChI=1S/C16H15F2N3O2S/c17-10-1-2-11(12(18)6-10)16-8-23-13(14-20-3-4-22-14)5-9(16)7-24-15(19)21-16/h1-4,6,9,13H,5,7-8H2,(H2,19,21)/t9-,13+,16-/m0/s1
US Patent
n/an/a 619n/an/an/an/a4.537
Pfizer Inc.
US Patent
Assay Description
This assay measures the inhibition of the BACE2 enzyme as it cleaves a non-native peptide. A synthetic substrate that can be cleaved by BACE2 having ...
US Patent US8962616 (2015)
BindingDB Entry DOI: 10.7270/Q20Z7216
Beta-secretase 1
(Homo sapiens (Human))
BDBM148173
(US8962616, 1)
Show SMILES NC1=N[C@]2(CO[C@H](C[C@H]2CS1)c1ncco1)c1ccc(F)cc1F |r,t:1|
Show InChI InChI=1S/C16H15F2N3O2S/c17-10-1-2-11(12(18)6-10)16-8-23-13(14-20-3-4-22-14)5-9(16)7-24-15(19)21-16/h1-4,6,9,13H,5,7-8H2,(H2,19,21)/t9-,13+,16-/m0/s1
n/an/a 614n/an/an/an/an/an/a
The Scripps Research Institute
Curated by ChEMBL
Assay Description
Inhibition of BACE1 in human H4 cells overexpressing wild type human APP695 assessed as colorimetric reaction by Whole cell assay
J Med Chem 58: 3223-52 (2015)
Article DOI: 10.1021/acs.jmedchem.5b00191
BindingDB Entry DOI: 10.7270/Q29W0H68
Cytochrome P450 2C19
(Homo sapiens (Human))
BDBM148173
(US8962616, 1)
Show SMILES NC1=N[C@]2(CO[C@H](C[C@H]2CS1)c1ncco1)c1ccc(F)cc1F |r,t:1|
Show InChI InChI=1S/C16H15F2N3O2S/c17-10-1-2-11(12(18)6-10)16-8-23-13(14-20-3-4-22-14)5-9(16)7-24-15(19)21-16/h1-4,6,9,13H,5,7-8H2,(H2,19,21)/t9-,13+,16-/m0/s1
Reactome pathway
n/an/a>3.00E+4n/an/an/an/an/an/a
The Scripps Research Institute
Curated by ChEMBL
Assay Description
Inhibition of CYP2C19 (unknown origin)
J Med Chem 58: 3223-52 (2015)
Article DOI: 10.1021/acs.jmedchem.5b00191
BindingDB Entry DOI: 10.7270/Q29W0H68
Potassium voltage-gated channel subfamily H member 2
(Homo sapiens (Human))
BDBM148173
(US8962616, 1)
Show SMILES NC1=N[C@]2(CO[C@H](C[C@H]2CS1)c1ncco1)c1ccc(F)cc1F |r,t:1|
Show InChI InChI=1S/C16H15F2N3O2S/c17-10-1-2-11(12(18)6-10)16-8-23-13(14-20-3-4-22-14)5-9(16)7-24-15(19)21-16/h1-4,6,9,13H,5,7-8H2,(H2,19,21)/t9-,13+,16-/m0/s1
Reactome pathway
n/an/a 1.06E+4n/an/an/an/an/an/a
The Scripps Research Institute
Curated by ChEMBL
Assay Description
Inhibition of human ERG expressed in CHO cells
J Med Chem 58: 3223-52 (2015)
Article DOI: 10.1021/acs.jmedchem.5b00191
BindingDB Entry DOI: 10.7270/Q29W0H68
Beta-secretase 1
(Homo sapiens (Human))
BDBM148173
(US8962616, 1)
Show SMILES NC1=N[C@]2(CO[C@H](C[C@H]2CS1)c1ncco1)c1ccc(F)cc1F |r,t:1|
Show InChI InChI=1S/C16H15F2N3O2S/c17-10-1-2-11(12(18)6-10)16-8-23-13(14-20-3-4-22-14)5-9(16)7-24-15(19)21-16/h1-4,6,9,13H,5,7-8H2,(H2,19,21)/t9-,13+,16-/m0/s1
n/an/a 27n/an/an/an/an/an/a
The Scripps Research Institute
Curated by ChEMBL
Assay Description
Inhibition of BACE1 (unknown origin) using Biotin-GLTNIKTEEISEISYEVEFR-C[oregon green]KK-OH substrate assessed as fluorescence polarization by cell f...
J Med Chem 58: 3223-52 (2015)
Article DOI: 10.1021/acs.jmedchem.5b00191
BindingDB Entry DOI: 10.7270/Q29W0H68
Cytochrome P450 1A
(Homo sapiens (Human))
BDBM148173
(US8962616, 1)
Show SMILES NC1=N[C@]2(CO[C@H](C[C@H]2CS1)c1ncco1)c1ccc(F)cc1F |r,t:1|
Show InChI InChI=1S/C16H15F2N3O2S/c17-10-1-2-11(12(18)6-10)16-8-23-13(14-20-3-4-22-14)5-9(16)7-24-15(19)21-16/h1-4,6,9,13H,5,7-8H2,(H2,19,21)/t9-,13+,16-/m0/s1
Reactome pathway
n/an/a 2.90E+4n/an/an/an/an/an/a
The Scripps Research Institute
Curated by ChEMBL
Assay Description
Inhibition of CYP1A2 (unknown origin)
J Med Chem 58: 3223-52 (2015)
Article DOI: 10.1021/acs.jmedchem.5b00191
BindingDB Entry DOI: 10.7270/Q29W0H68
Cytochrome P450 2C8
(Homo sapiens (Human))
BDBM148173
(US8962616, 1)
Show SMILES NC1=N[C@]2(CO[C@H](C[C@H]2CS1)c1ncco1)c1ccc(F)cc1F |r,t:1|
Show InChI InChI=1S/C16H15F2N3O2S/c17-10-1-2-11(12(18)6-10)16-8-23-13(14-20-3-4-22-14)5-9(16)7-24-15(19)21-16/h1-4,6,9,13H,5,7-8H2,(H2,19,21)/t9-,13+,16-/m0/s1
n/an/a>3.00E+4n/an/an/an/an/an/a
The Scripps Research Institute
Curated by ChEMBL
Assay Description
Inhibition of CYP2C8 (unknown origin)
J Med Chem 58: 3223-52 (2015)
Article DOI: 10.1021/acs.jmedchem.5b00191
BindingDB Entry DOI: 10.7270/Q29W0H68
Cytochrome P450 2D6
(Homo sapiens (Human))
BDBM148173
(US8962616, 1)
Show SMILES NC1=N[C@]2(CO[C@H](C[C@H]2CS1)c1ncco1)c1ccc(F)cc1F |r,t:1|
Show InChI InChI=1S/C16H15F2N3O2S/c17-10-1-2-11(12(18)6-10)16-8-23-13(14-20-3-4-22-14)5-9(16)7-24-15(19)21-16/h1-4,6,9,13H,5,7-8H2,(H2,19,21)/t9-,13+,16-/m0/s1
n/an/a 330n/an/an/an/an/an/a
The Scripps Research Institute
Curated by ChEMBL
Assay Description
Inhibition of CYP2D6 in human liver microsomes
J Med Chem 58: 3223-52 (2015)
Article DOI: 10.1021/acs.jmedchem.5b00191
BindingDB Entry DOI: 10.7270/Q29W0H68
Cytochrome P450 3A4
(Homo sapiens (Human))
BDBM148173
(US8962616, 1)
Show SMILES NC1=N[C@]2(CO[C@H](C[C@H]2CS1)c1ncco1)c1ccc(F)cc1F |r,t:1|
Show InChI InChI=1S/C16H15F2N3O2S/c17-10-1-2-11(12(18)6-10)16-8-23-13(14-20-3-4-22-14)5-9(16)7-24-15(19)21-16/h1-4,6,9,13H,5,7-8H2,(H2,19,21)/t9-,13+,16-/m0/s1
Reactome pathway
n/an/a>3.00E+4n/an/an/an/an/an/a
The Scripps Research Institute
Curated by ChEMBL
Assay Description
Inhibition of CYP3A4 (unknown origin)
J Med Chem 58: 3223-52 (2015)
Article DOI: 10.1021/acs.jmedchem.5b00191
BindingDB Entry DOI: 10.7270/Q29W0H68
Cathepsin D
(Homo sapiens (Human))
BDBM148173
(US8962616, 1)
Show SMILES NC1=N[C@]2(CO[C@H](C[C@H]2CS1)c1ncco1)c1ccc(F)cc1F |r,t:1|
Show InChI InChI=1S/C16H15F2N3O2S/c17-10-1-2-11(12(18)6-10)16-8-23-13(14-20-3-4-22-14)5-9(16)7-24-15(19)21-16/h1-4,6,9,13H,5,7-8H2,(H2,19,21)/t9-,13+,16-/m0/s1
NCI pathway
Reactome pathway
n/an/a 7.49E+4n/an/an/an/an/an/a
The Scripps Research Institute
Curated by ChEMBL
Assay Description
Inhibition of CatD (unknown origin) assessed as fluorescence polarization by cell free assay
J Med Chem 58: 3223-52 (2015)
Article DOI: 10.1021/acs.jmedchem.5b00191
BindingDB Entry DOI: 10.7270/Q29W0H68