BDBM14831 3-(3-tert-butyl-1-methyl-1H-pyrazol-5-yl)-1-(4-chlorophenyl)urea::3-(4-chlorophenyl)-1-(2-methyl-5-tert-butyl-pyrazol-3-yl)urea::CHEMBL87277::Dopamine D2 receptor and serotonin 2a receptor::diaryl urea compound 2::diaryl urea inhibitor 1
SMILES: Cn1nc(cc1NC(=O)Nc1ccc(Cl)cc1)C(C)(C)C
InChI Key: InChIKey=FWIJKWMXNHRSRO-UHFFFAOYSA-N
Data: 3 IC50  4 Kd  1 Koff  2 Kon  1 ITC
PDB links: 6 PDB IDs match this monomer.
Activity Spreadsheet -- Enzyme Inhibition Constant Data from BindingDB
Found 9 hits for monomerid = 14831
Trg + Lig
Ki
nM
ΔG°
kcal/mole
IC50
nM
Kd
nM
EC50/IC50
nM
koff
s-1
kon
M-1s-1
pHTemp
°C
Mitogen-activated protein kinase 14
(Homo sapiens (Human))
BDBM14831
(3-(3-tert-butyl-1-methyl-1H-pyrazol-5-yl)-1-(4-chl...)
Show SMILES Cn1nc(cc1NC(=O)Nc1ccc(Cl)cc1)C(C)(C)C
Show InChI InChI=1S/C15H19ClN4O/c1-15(2,3)12-9-13(20(4)19-12)18-14(21)17-11-7-5-10(16)6-8-11/h5-9H,1-4H3,(H2,17,18,21)
NCI pathway
Reactome pathway
n/an/an/a 1.16E+3n/an/an/a7.023
Boehringer Ingelheim Pharmaceuticals Inc.
Assay Description
The exchange curve assays were run as two half-reactions using an SLM Aminco Bowman Series 2 model SQ-340 fluorescence detector. In the first half re...
Nat Struct Biol 9: 268-72 (2002)
Article DOI: 10.1038/nsb770
BindingDB Entry DOI: 10.7270/Q2CV4FZ3
3D
3D Structure (crystal)
Mitogen-activated protein kinase 14
(Homo sapiens (Human))
BDBM14831
(3-(3-tert-butyl-1-methyl-1H-pyrazol-5-yl)-1-(4-chl...)
Show SMILES Cn1nc(cc1NC(=O)Nc1ccc(Cl)cc1)C(C)(C)C
Show InChI InChI=1S/C15H19ClN4O/c1-15(2,3)12-9-13(20(4)19-12)18-14(21)17-11-7-5-10(16)6-8-11/h5-9H,1-4H3,(H2,17,18,21)
NCI pathway
Reactome pathway
n/an/an/a 1.16E+3n/an/an/a7.023
Boehringer Ingelheim Pharmaceuticals Inc.
Assay Description
The exchange curve assays were run as two half-reactions using an SLM Aminco Bowman Series 2 model SQ-340 fluorescence detector. In the first half re...
J Med Chem 46: 4669-75 (2003)
Article DOI: 10.1021/jm030120s
BindingDB Entry DOI: 10.7270/Q2833Q8J
3D
3D Structure (crystal)
Mitogen-activated protein kinase 14
(Homo sapiens (Human))
BDBM14831
(3-(3-tert-butyl-1-methyl-1H-pyrazol-5-yl)-1-(4-chl...)
Show SMILES Cn1nc(cc1NC(=O)Nc1ccc(Cl)cc1)C(C)(C)C
Show InChI InChI=1S/C15H19ClN4O/c1-15(2,3)12-9-13(20(4)19-12)18-14(21)17-11-7-5-10(16)6-8-11/h5-9H,1-4H3,(H2,17,18,21)
NCI pathway
Reactome pathway
n/an/an/an/an/an/a 1.18E+5n/an/a
Boehringer Ingelheim Pharmaceuticals
Curated by ChEMBL
Assay Description
Binding affinity for Mitogen-activated protein kinase p38 alpha
Bioorg Med Chem Lett 13: 3101-4 (2003)
BindingDB Entry DOI: 10.7270/Q2CR5SSB
3D
3D Structure (crystal)
Mitogen-activated protein kinase 14
(Homo sapiens (Human))
BDBM14831
(3-(3-tert-butyl-1-methyl-1H-pyrazol-5-yl)-1-(4-chl...)
Show SMILES Cn1nc(cc1NC(=O)Nc1ccc(Cl)cc1)C(C)(C)C
Show InChI InChI=1S/C15H19ClN4O/c1-15(2,3)12-9-13(20(4)19-12)18-14(21)17-11-7-5-10(16)6-8-11/h5-9H,1-4H3,(H2,17,18,21)
NCI pathway
Reactome pathway
n/an/an/an/an/a 0.140 1.18E+5n/an/a
Boehringer Ingelheim Pharmaceuticals
Curated by ChEMBL
Assay Description
Binding affinity for Mitogen-activated protein kinase p38 alpha
Bioorg Med Chem Lett 13: 3101-4 (2003)
BindingDB Entry DOI: 10.7270/Q2CR5SSB
3D
3D Structure (crystal)
Mitogen-activated protein kinase 14
(Homo sapiens (Human))
BDBM14831
(3-(3-tert-butyl-1-methyl-1H-pyrazol-5-yl)-1-(4-chl...)
Show SMILES Cn1nc(cc1NC(=O)Nc1ccc(Cl)cc1)C(C)(C)C
Show InChI InChI=1S/C15H19ClN4O/c1-15(2,3)12-9-13(20(4)19-12)18-14(21)17-11-7-5-10(16)6-8-11/h5-9H,1-4H3,(H2,17,18,21)
NCI pathway
Reactome pathway
n/an/a 794n/an/an/an/an/an/a
GlaxoSmithKline
Curated by ChEMBL
Assay Description
Inhibition of p38alpha (unknown origin)
J Med Chem 61: 6421-6467 (2018)
Article DOI: 10.1021/acs.jmedchem.8b00180
BindingDB Entry DOI: 10.7270/Q2DJ5J62
3D
3D Structure (crystal)
Mitogen-activated protein kinase 14
(Homo sapiens (Human))
BDBM14831
(3-(3-tert-butyl-1-methyl-1H-pyrazol-5-yl)-1-(4-chl...)
Show SMILES Cn1nc(cc1NC(=O)Nc1ccc(Cl)cc1)C(C)(C)C
Show InChI InChI=1S/C15H19ClN4O/c1-15(2,3)12-9-13(20(4)19-12)18-14(21)17-11-7-5-10(16)6-8-11/h5-9H,1-4H3,(H2,17,18,21)
NCI pathway
Reactome pathway
n/an/a 2.10E+4n/an/an/an/an/an/a
Chemical Genomics Centre of the Max Planck Society
Curated by ChEMBL
Assay Description
Inhibition of p38alpha active form expressed in Escherichia coli BL21(DE3) cells by HTRF assay
J Med Chem 53: 357-67 (2010)
Article DOI: 10.1021/jm901297e
BindingDB Entry DOI: 10.7270/Q29W0FKC
3D
3D Structure (crystal)
Mitogen-activated protein kinase 14
(Homo sapiens (Human))
BDBM14831
(3-(3-tert-butyl-1-methyl-1H-pyrazol-5-yl)-1-(4-chl...)
Show SMILES Cn1nc(cc1NC(=O)Nc1ccc(Cl)cc1)C(C)(C)C
Show InChI InChI=1S/C15H19ClN4O/c1-15(2,3)12-9-13(20(4)19-12)18-14(21)17-11-7-5-10(16)6-8-11/h5-9H,1-4H3,(H2,17,18,21)
NCI pathway
Reactome pathway
n/an/a 1.68E+4n/an/an/an/an/an/a
Chemical Genomics Centre of the Max Planck Society
Curated by ChEMBL
Assay Description
Displacemnt of N,N'-(2,2'-(3,3'-disulfanediylbis(2,5-dioxopyrrolidine-3,1-diyl))bis(ethane-2,1-diyl))bis(2-(3-(3-tert-butyl-5-(3-naphthalen-1-ylureid...
J Med Chem 53: 357-67 (2010)
Article DOI: 10.1021/jm901297e
BindingDB Entry DOI: 10.7270/Q29W0FKC
3D
3D Structure (crystal)
Mitogen-activated protein kinase 14
(Homo sapiens (Human))
BDBM14831
(3-(3-tert-butyl-1-methyl-1H-pyrazol-5-yl)-1-(4-chl...)
Show SMILES Cn1nc(cc1NC(=O)Nc1ccc(Cl)cc1)C(C)(C)C
Show InChI InChI=1S/C15H19ClN4O/c1-15(2,3)12-9-13(20(4)19-12)18-14(21)17-11-7-5-10(16)6-8-11/h5-9H,1-4H3,(H2,17,18,21)
NCI pathway
Reactome pathway
n/an/an/a 1.16E+3n/an/an/an/an/a
Novartis Research Foundation
Curated by ChEMBL
Assay Description
Inhibition of p38alpha kinase
Nat Chem Biol 2: 358-64 (2006)
Article DOI: 10.1038/nchembio799
BindingDB Entry DOI: 10.7270/Q2CC10WV
3D
3D Structure (crystal)
Mitogen-activated protein kinase 14
(Homo sapiens (Human))
BDBM14831
(3-(3-tert-butyl-1-methyl-1H-pyrazol-5-yl)-1-(4-chl...)
Show SMILES Cn1nc(cc1NC(=O)Nc1ccc(Cl)cc1)C(C)(C)C
Show InChI InChI=1S/C15H19ClN4O/c1-15(2,3)12-9-13(20(4)19-12)18-14(21)17-11-7-5-10(16)6-8-11/h5-9H,1-4H3,(H2,17,18,21)
NCI pathway
Reactome pathway
n/an/an/a 1.19E+3n/an/an/an/an/a
Boehringer Ingelheim Pharmaceuticals
Curated by ChEMBL
Assay Description
Binding affinity for Mitogen-activated protein kinase p38 alpha
Bioorg Med Chem Lett 13: 3101-4 (2003)
BindingDB Entry DOI: 10.7270/Q2CR5SSB
3D
3D Structure (crystal)
Activity Spreadsheet -- ITC Data from BindingDB
Found 1 hit for monomerid = 14831
Cell (A)Syringe (B)Cell
Syringe
Cell + Syr
ΔG°
kcal/mole
-TΔS°
kcal/mole
ΔH°
kcal/mole
log KpHTemp
°C
BDBM14831
JPEG
(3-(3-tert-butyl-1-methyl-1H-pyrazol-5-yl)-1-(4-chl...)
5-hydroxytryptamine receptor 2A
(Homo sapiens (Human))
n/an/a-5.595.94725
Boehringer Ingelheim Pharmaceuticals Inc.
J Med Chem 46: 4669-75 (2003)