null
SMILES: CNCc1ccc2c(ccnc2c1)-c1cnn2cc(cnc12)-c1ccc(cc1)N1CCNCC1
InChI Key: InChIKey=QZRFOUZVAXYJTM-UHFFFAOYSA-N
Activity Spreadsheet -- Enzyme Inhibition Constant Data from BindingDB
Found 8 hits for monomerid = 148328
Trg + Lig
Ki
nM
ΔG°
kcal/mole
IC50
nM
Kd
nM
EC50/IC50
nM
koff
s-1
kon
M-1s-1
pHTemp
°C
Serine/threonine-protein kinase receptor R3
(Homo sapiens (Human))
BDBM148328
(US10017516, Compound 18 | US9682983, 18)
Show SMILES CNCc1ccc2c(ccnc2c1)-c1cnn2cc(cnc12)-c1ccc(cc1)N1CCNCC1 |$;HN;;;;;;;;;;;;;;;;;;;;;;;;;;;;;;;;$|
Show InChI InChI=1S/C27H27N7/c1-28-15-19-2-7-24-23(8-9-30-26(24)14-19)25-17-32-34-18-21(16-31-27(25)34)20-3-5-22(6-4-20)33-12-10-29-11-13-33/h2-9,14,16-18,28-29H,10-13,15H2,1H3
US Patent
n/an/a 2.50E+3n/an/an/an/a7.5n/a
The Brigham and Women's Hospital, Inc.; Dept. of Health and Human Services, National Institutes of Health
US Patent
Assay Description
Specifically, compounds were assayed using LANCE® Ultra ULight¿ technology (Perkin Elmer) against human ALK1-6 enzymes (ALK1: Life Technologies, ALK2...
US Patent US9682983 (2017)
BindingDB Entry DOI: 10.7270/Q28S4N3R
Activin receptor type-1
(Homo sapiens (Human))
BDBM148328
(US10017516, Compound 18 | US9682983, 18)
Show SMILES CNCc1ccc2c(ccnc2c1)-c1cnn2cc(cnc12)-c1ccc(cc1)N1CCNCC1 |$;HN;;;;;;;;;;;;;;;;;;;;;;;;;;;;;;;;$|
Show InChI InChI=1S/C27H27N7/c1-28-15-19-2-7-24-23(8-9-30-26(24)14-19)25-17-32-34-18-21(16-31-27(25)34)20-3-5-22(6-4-20)33-12-10-29-11-13-33/h2-9,14,16-18,28-29H,10-13,15H2,1H3
US Patent
n/an/a 906n/an/an/an/a7.5n/a
The Brigham and Women's Hospital, Inc.; Dept. of Health and Human Services, National Institutes of Health
US Patent
Assay Description
Specifically, compounds were assayed using LANCE® Ultra ULight¿ technology (Perkin Elmer) against human ALK1-6 enzymes (ALK1: Life Technologies, ALK2...
US Patent US9682983 (2017)
BindingDB Entry DOI: 10.7270/Q28S4N3R
Bone morphogenetic protein receptor type-1A
(Homo sapiens (Human))
BDBM148328
(US10017516, Compound 18 | US9682983, 18)
Show SMILES CNCc1ccc2c(ccnc2c1)-c1cnn2cc(cnc12)-c1ccc(cc1)N1CCNCC1 |$;HN;;;;;;;;;;;;;;;;;;;;;;;;;;;;;;;;$|
Show InChI InChI=1S/C27H27N7/c1-28-15-19-2-7-24-23(8-9-30-26(24)14-19)25-17-32-34-18-21(16-31-27(25)34)20-3-5-22(6-4-20)33-12-10-29-11-13-33/h2-9,14,16-18,28-29H,10-13,15H2,1H3
US Patent
n/an/a 4.37E+3n/an/an/an/a7.5n/a
The Brigham and Women's Hospital, Inc.; Dept. of Health and Human Services, National Institutes of Health
US Patent
Assay Description
Specifically, compounds were assayed using LANCE® Ultra ULight¿ technology (Perkin Elmer) against human ALK1-6 enzymes (ALK1: Life Technologies, ALK2...
US Patent US9682983 (2017)
BindingDB Entry DOI: 10.7270/Q28S4N3R
Bone morphogenetic protein receptor type-1B
(Homo sapiens (Human))
BDBM148328
(US10017516, Compound 18 | US9682983, 18)
Show SMILES CNCc1ccc2c(ccnc2c1)-c1cnn2cc(cnc12)-c1ccc(cc1)N1CCNCC1 |$;HN;;;;;;;;;;;;;;;;;;;;;;;;;;;;;;;;$|
Show InChI InChI=1S/C27H27N7/c1-28-15-19-2-7-24-23(8-9-30-26(24)14-19)25-17-32-34-18-21(16-31-27(25)34)20-3-5-22(6-4-20)33-12-10-29-11-13-33/h2-9,14,16-18,28-29H,10-13,15H2,1H3
US Patent
n/an/a 2.59E+3n/an/an/an/an/an/a
The Brigham and Women's Hospital, Inc.
US Patent
Assay Description
Compounds were assessed in ALK1-6 enzymatic assays. Specifically, compounds were assayed using LANCE® Ultra ULight technology (Perkin Elmer) against ...
US Patent US10017516 (2018)
BindingDB Entry DOI: 10.7270/Q20P12CN
Serine/threonine-protein kinase receptor R3
(Homo sapiens (Human))
BDBM148328
(US10017516, Compound 18 | US9682983, 18)
Show SMILES CNCc1ccc2c(ccnc2c1)-c1cnn2cc(cnc12)-c1ccc(cc1)N1CCNCC1 |$;HN;;;;;;;;;;;;;;;;;;;;;;;;;;;;;;;;$|
Show InChI InChI=1S/C27H27N7/c1-28-15-19-2-7-24-23(8-9-30-26(24)14-19)25-17-32-34-18-21(16-31-27(25)34)20-3-5-22(6-4-20)33-12-10-29-11-13-33/h2-9,14,16-18,28-29H,10-13,15H2,1H3
US Patent
n/an/a 2.50E+3n/an/an/an/an/an/a
The Brigham and Women's Hospital, Inc.
US Patent
Assay Description
Compounds were assessed in ALK1-6 enzymatic assays. Specifically, compounds were assayed using LANCE® Ultra ULight technology (Perkin Elmer) against ...
US Patent US10017516 (2018)
BindingDB Entry DOI: 10.7270/Q20P12CN
Activin receptor type-1
(Homo sapiens (Human))
BDBM148328
(US10017516, Compound 18 | US9682983, 18)
Show SMILES CNCc1ccc2c(ccnc2c1)-c1cnn2cc(cnc12)-c1ccc(cc1)N1CCNCC1 |$;HN;;;;;;;;;;;;;;;;;;;;;;;;;;;;;;;;$|
Show InChI InChI=1S/C27H27N7/c1-28-15-19-2-7-24-23(8-9-30-26(24)14-19)25-17-32-34-18-21(16-31-27(25)34)20-3-5-22(6-4-20)33-12-10-29-11-13-33/h2-9,14,16-18,28-29H,10-13,15H2,1H3
US Patent
n/an/a 906n/an/an/an/an/an/a
The Brigham and Women's Hospital, Inc.
US Patent
Assay Description
Compounds were assessed in ALK1-6 enzymatic assays. Specifically, compounds were assayed using LANCE® Ultra ULight technology (Perkin Elmer) against ...
US Patent US10017516 (2018)
BindingDB Entry DOI: 10.7270/Q20P12CN
Bone morphogenetic protein receptor type-1A
(Homo sapiens (Human))
BDBM148328
(US10017516, Compound 18 | US9682983, 18)
Show SMILES CNCc1ccc2c(ccnc2c1)-c1cnn2cc(cnc12)-c1ccc(cc1)N1CCNCC1 |$;HN;;;;;;;;;;;;;;;;;;;;;;;;;;;;;;;;$|
Show InChI InChI=1S/C27H27N7/c1-28-15-19-2-7-24-23(8-9-30-26(24)14-19)25-17-32-34-18-21(16-31-27(25)34)20-3-5-22(6-4-20)33-12-10-29-11-13-33/h2-9,14,16-18,28-29H,10-13,15H2,1H3
US Patent
n/an/a 4.37E+3n/an/an/an/an/an/a
The Brigham and Women's Hospital, Inc.
US Patent
Assay Description
Compounds were assessed in ALK1-6 enzymatic assays. Specifically, compounds were assayed using LANCE® Ultra ULight technology (Perkin Elmer) against ...
US Patent US10017516 (2018)
BindingDB Entry DOI: 10.7270/Q20P12CN
Bone morphogenetic protein receptor type-1B
(Homo sapiens (Human))
BDBM148328
(US10017516, Compound 18 | US9682983, 18)
Show SMILES CNCc1ccc2c(ccnc2c1)-c1cnn2cc(cnc12)-c1ccc(cc1)N1CCNCC1 |$;HN;;;;;;;;;;;;;;;;;;;;;;;;;;;;;;;;$|
Show InChI InChI=1S/C27H27N7/c1-28-15-19-2-7-24-23(8-9-30-26(24)14-19)25-17-32-34-18-21(16-31-27(25)34)20-3-5-22(6-4-20)33-12-10-29-11-13-33/h2-9,14,16-18,28-29H,10-13,15H2,1H3
US Patent
n/an/a 2.59E+3n/an/an/an/a7.5n/a
The Brigham and Women's Hospital, Inc.; Dept. of Health and Human Services, National Institutes of Health
US Patent
Assay Description
Specifically, compounds were assayed using LANCE® Ultra ULight¿ technology (Perkin Elmer) against human ALK1-6 enzymes (ALK1: Life Technologies, ALK2...
US Patent US9682983 (2017)
BindingDB Entry DOI: 10.7270/Q28S4N3R