null
SMILES: C(N1CCCC1)c1ccc2c(ccnc2c1)-c1cnn2cc(cnc12)-c1ccc(cc1)N1CCNCC1
InChI Key: InChIKey=QTXBTKLWQFSQLZ-UHFFFAOYSA-N
Activity Spreadsheet -- Enzyme Inhibition Constant Data from BindingDB
Found 8 hits for monomerid = 148347
Trg + Lig
Ki
nM
ΔG°
kcal/mole
IC50
nM
Kd
nM
EC50/IC50
nM
koff
s-1
kon
M-1s-1
pHTemp
°C
Serine/threonine-protein kinase receptor R3
(Homo sapiens (Human))
BDBM148347
(US10017516, Compound 21 | US9682983, 21)
Show SMILES C(N1CCCC1)c1ccc2c(ccnc2c1)-c1cnn2cc(cnc12)-c1ccc(cc1)N1CCNCC1
Show InChI InChI=1S/C30H31N7/c1-2-14-35(13-1)20-22-3-8-27-26(9-10-32-29(27)17-22)28-19-34-37-21-24(18-33-30(28)37)23-4-6-25(7-5-23)36-15-11-31-12-16-36/h3-10,17-19,21,31H,1-2,11-16,20H2
US Patent
n/an/a 7.86E+3n/an/an/an/a7.5n/a
The Brigham and Women's Hospital, Inc.; Dept. of Health and Human Services, National Institutes of Health
US Patent
Assay Description
Specifically, compounds were assayed using LANCE® Ultra ULight¿ technology (Perkin Elmer) against human ALK1-6 enzymes (ALK1: Life Technologies, ALK2...
US Patent US9682983 (2017)
BindingDB Entry DOI: 10.7270/Q28S4N3R
Activin receptor type-1
(Homo sapiens (Human))
BDBM148347
(US10017516, Compound 21 | US9682983, 21)
Show SMILES C(N1CCCC1)c1ccc2c(ccnc2c1)-c1cnn2cc(cnc12)-c1ccc(cc1)N1CCNCC1
Show InChI InChI=1S/C30H31N7/c1-2-14-35(13-1)20-22-3-8-27-26(9-10-32-29(27)17-22)28-19-34-37-21-24(18-33-30(28)37)23-4-6-25(7-5-23)36-15-11-31-12-16-36/h3-10,17-19,21,31H,1-2,11-16,20H2
US Patent
n/an/a 2.14E+3n/an/an/an/a7.5n/a
The Brigham and Women's Hospital, Inc.; Dept. of Health and Human Services, National Institutes of Health
US Patent
Assay Description
Specifically, compounds were assayed using LANCE® Ultra ULight¿ technology (Perkin Elmer) against human ALK1-6 enzymes (ALK1: Life Technologies, ALK2...
US Patent US9682983 (2017)
BindingDB Entry DOI: 10.7270/Q28S4N3R
Bone morphogenetic protein receptor type-1A
(Homo sapiens (Human))
BDBM148347
(US10017516, Compound 21 | US9682983, 21)
Show SMILES C(N1CCCC1)c1ccc2c(ccnc2c1)-c1cnn2cc(cnc12)-c1ccc(cc1)N1CCNCC1
Show InChI InChI=1S/C30H31N7/c1-2-14-35(13-1)20-22-3-8-27-26(9-10-32-29(27)17-22)28-19-34-37-21-24(18-33-30(28)37)23-4-6-25(7-5-23)36-15-11-31-12-16-36/h3-10,17-19,21,31H,1-2,11-16,20H2
US Patent
n/an/a 5.26E+3n/an/an/an/a7.5n/a
The Brigham and Women's Hospital, Inc.; Dept. of Health and Human Services, National Institutes of Health
US Patent
Assay Description
Specifically, compounds were assayed using LANCE® Ultra ULight¿ technology (Perkin Elmer) against human ALK1-6 enzymes (ALK1: Life Technologies, ALK2...
US Patent US9682983 (2017)
BindingDB Entry DOI: 10.7270/Q28S4N3R
Bone morphogenetic protein receptor type-1B
(Homo sapiens (Human))
BDBM148347
(US10017516, Compound 21 | US9682983, 21)
Show SMILES C(N1CCCC1)c1ccc2c(ccnc2c1)-c1cnn2cc(cnc12)-c1ccc(cc1)N1CCNCC1
Show InChI InChI=1S/C30H31N7/c1-2-14-35(13-1)20-22-3-8-27-26(9-10-32-29(27)17-22)28-19-34-37-21-24(18-33-30(28)37)23-4-6-25(7-5-23)36-15-11-31-12-16-36/h3-10,17-19,21,31H,1-2,11-16,20H2
US Patent
n/an/a 3.51E+3n/an/an/an/an/an/a
The Brigham and Women's Hospital, Inc.
US Patent
Assay Description
Compounds were assessed in ALK1-6 enzymatic assays. Specifically, compounds were assayed using LANCE® Ultra ULight technology (Perkin Elmer) against ...
US Patent US10017516 (2018)
BindingDB Entry DOI: 10.7270/Q20P12CN
Serine/threonine-protein kinase receptor R3
(Homo sapiens (Human))
BDBM148347
(US10017516, Compound 21 | US9682983, 21)
Show SMILES C(N1CCCC1)c1ccc2c(ccnc2c1)-c1cnn2cc(cnc12)-c1ccc(cc1)N1CCNCC1
Show InChI InChI=1S/C30H31N7/c1-2-14-35(13-1)20-22-3-8-27-26(9-10-32-29(27)17-22)28-19-34-37-21-24(18-33-30(28)37)23-4-6-25(7-5-23)36-15-11-31-12-16-36/h3-10,17-19,21,31H,1-2,11-16,20H2
US Patent
n/an/a 7.86E+3n/an/an/an/an/an/a
The Brigham and Women's Hospital, Inc.
US Patent
Assay Description
Compounds were assessed in ALK1-6 enzymatic assays. Specifically, compounds were assayed using LANCE® Ultra ULight technology (Perkin Elmer) against ...
US Patent US10017516 (2018)
BindingDB Entry DOI: 10.7270/Q20P12CN
Activin receptor type-1
(Homo sapiens (Human))
BDBM148347
(US10017516, Compound 21 | US9682983, 21)
Show SMILES C(N1CCCC1)c1ccc2c(ccnc2c1)-c1cnn2cc(cnc12)-c1ccc(cc1)N1CCNCC1
Show InChI InChI=1S/C30H31N7/c1-2-14-35(13-1)20-22-3-8-27-26(9-10-32-29(27)17-22)28-19-34-37-21-24(18-33-30(28)37)23-4-6-25(7-5-23)36-15-11-31-12-16-36/h3-10,17-19,21,31H,1-2,11-16,20H2
US Patent
n/an/a 2.14E+3n/an/an/an/an/an/a
The Brigham and Women's Hospital, Inc.
US Patent
Assay Description
Compounds were assessed in ALK1-6 enzymatic assays. Specifically, compounds were assayed using LANCE® Ultra ULight technology (Perkin Elmer) against ...
US Patent US10017516 (2018)
BindingDB Entry DOI: 10.7270/Q20P12CN
Bone morphogenetic protein receptor type-1A
(Homo sapiens (Human))
BDBM148347
(US10017516, Compound 21 | US9682983, 21)
Show SMILES C(N1CCCC1)c1ccc2c(ccnc2c1)-c1cnn2cc(cnc12)-c1ccc(cc1)N1CCNCC1
Show InChI InChI=1S/C30H31N7/c1-2-14-35(13-1)20-22-3-8-27-26(9-10-32-29(27)17-22)28-19-34-37-21-24(18-33-30(28)37)23-4-6-25(7-5-23)36-15-11-31-12-16-36/h3-10,17-19,21,31H,1-2,11-16,20H2
US Patent
n/an/a 5.26E+3n/an/an/an/an/an/a
The Brigham and Women's Hospital, Inc.
US Patent
Assay Description
Compounds were assessed in ALK1-6 enzymatic assays. Specifically, compounds were assayed using LANCE® Ultra ULight technology (Perkin Elmer) against ...
US Patent US10017516 (2018)
BindingDB Entry DOI: 10.7270/Q20P12CN
Bone morphogenetic protein receptor type-1B
(Homo sapiens (Human))
BDBM148347
(US10017516, Compound 21 | US9682983, 21)
Show SMILES C(N1CCCC1)c1ccc2c(ccnc2c1)-c1cnn2cc(cnc12)-c1ccc(cc1)N1CCNCC1
Show InChI InChI=1S/C30H31N7/c1-2-14-35(13-1)20-22-3-8-27-26(9-10-32-29(27)17-22)28-19-34-37-21-24(18-33-30(28)37)23-4-6-25(7-5-23)36-15-11-31-12-16-36/h3-10,17-19,21,31H,1-2,11-16,20H2
US Patent
n/an/a 3.51E+3n/an/an/an/a7.5n/a
The Brigham and Women's Hospital, Inc.; Dept. of Health and Human Services, National Institutes of Health
US Patent
Assay Description
Specifically, compounds were assayed using LANCE® Ultra ULight¿ technology (Perkin Elmer) against human ALK1-6 enzymes (ALK1: Life Technologies, ALK2...
US Patent US9682983 (2017)
BindingDB Entry DOI: 10.7270/Q28S4N3R