BDBM14897 2-[3-(5-carbamimidoyl-1H-1,3-benzodiazol-2-yl)-4-hydroxy-5-phenylphenyl]butanedioic acid::5-amidino benzimidazole analog 1::CHEMBL206069
SMILES: NC(=N)c1ccc2nc([nH]c2c1)-c1cc(cc(-c2ccccc2)c1O)C(CC(O)=O)C(O)=O
InChI Key: InChIKey=FXLFNEVHWHPROF-UHFFFAOYSA-N
Data: 2 KI
PDB links: 4 PDB IDs contain this monomer as substructures. 4 PDB IDs contain inhibitors having a similarity of 90% to this monomer.
Activity Spreadsheet -- Enzyme Inhibition Constant Data from BindingDB
Found 2 hits for monomerid = 14897
Trg + Lig
Ki
nM
ΔG°
kcal/mole
IC50
nM
Kd
nM
EC50/IC50
nM
koff
s-1
kon
M-1s-1
pHTemp
°C
Plasma kallikrein
(Homo sapiens (Human))
BDBM14897
(2-[3-(5-carbamimidoyl-1H-1,3-benzodiazol-2-yl)-4-h...)
Show SMILES NC(=N)c1ccc2nc([nH]c2c1)-c1cc(cc(-c2ccccc2)c1O)C(CC(O)=O)C(O)=O
Show InChI InChI=1S/C24H20N4O5/c25-22(26)13-6-7-18-19(10-13)28-23(27-18)17-9-14(16(24(32)33)11-20(29)30)8-15(21(17)31)12-4-2-1-3-5-12/h1-10,16,31H,11H2,(H3,25,26)(H,27,28)(H,29,30)(H,32,33)
8n/an/an/an/an/an/an/an/a
Celera Genomics
Curated by ChEMBL
Assay Description
Binding affinity to plasma kallikrein
Bioorg Med Chem Lett 16: 2034-6 (2006)
Article DOI: 10.1016/j.bmcl.2005.12.060
BindingDB Entry DOI: 10.7270/Q2P55N3N
Coagulation factor VII
(Homo sapiens (Human))
BDBM14897
(2-[3-(5-carbamimidoyl-1H-1,3-benzodiazol-2-yl)-4-h...)
Show SMILES NC(=N)c1ccc2nc([nH]c2c1)-c1cc(cc(-c2ccccc2)c1O)C(CC(O)=O)C(O)=O
Show InChI InChI=1S/C24H20N4O5/c25-22(26)13-6-7-18-19(10-13)28-23(27-18)17-9-14(16(24(32)33)11-20(29)30)8-15(21(17)31)12-4-2-1-3-5-12/h1-10,16,31H,11H2,(H3,25,26)(H,27,28)(H,29,30)(H,32,33)
Reactome pathway
74 -9.62n/an/an/an/an/a7.422
Celera
Assay Description
The enzyme reactions were initiated by the addition of substrate, and the color developed from the release of p-nitroanilide from each chromogenic su...
Bioorg Med Chem Lett 16: 1596-600 (2006)
Article DOI: 10.1016/j.bmcl.2005.12.040
BindingDB Entry DOI: 10.7270/Q2VX0DSZ