BDBM149035 US8962648, 267
SMILES: CCNCc1ccc(cc1)-c1c(O)ccc2[nH]c(=O)c3sccc3c12
InChI Key: InChIKey=QELNVKPPJUAARQ-UHFFFAOYSA-N
Data: 1 IC50
Activity Spreadsheet -- Enzyme Inhibition Constant Data from BindingDB
Found 1 hit for monomerid = 149035
Trg + Lig
Ki
nM
ΔG°
kcal/mole
IC50
nM
Kd
nM
EC50/IC50
nM
koff
s-1
kon
M-1s-1
pHTemp
°C
PDZ-binding kinase
(Homo sapiens (Human))
BDBM149035
(US8962648, 267)
Show SMILES CCNCc1ccc(cc1)-c1c(O)ccc2[nH]c(=O)c3sccc3c12
Show InChI InChI=1S/C20H18N2O2S/c1-2-21-11-12-3-5-13(6-4-12)17-16(23)8-7-15-18(17)14-9-10-25-19(14)20(24)22-15/h3-10,21,23H,2,11H2,1H3,(H,22,24)
NCI pathway
Reactome pathway
US Patent
n/an/a 2n/an/an/an/a7.425
OncoTherapy Science, Inc.
US Patent
Assay Description
PBK activity was determined in the presence or absence of compounds using fluorescein isothiocyanate-labeled (FITC-labeled) histone H3 peptide as a s...
US Patent US8962648 (2015)
BindingDB Entry DOI: 10.7270/Q27H1H9K