BDBM149074 US8962648, 359
SMILES: CC(N)c1ccc(cc1F)-c1c(O)ccc2[nH]c(=O)c3sccc3c12
InChI Key:
Data: 1 IC50
Activity Spreadsheet -- Enzyme Inhibition Constant Data from BindingDB
Found 1 hit for monomerid = 149074
Trg + Lig
Ki
nM
ΔG°
kcal/mole
IC50
nM
Kd
nM
EC50/IC50
nM
koff
s-1
kon
M-1s-1
pHTemp
°C
PDZ-binding kinase
(Homo sapiens (Human))
BDBM149074
(US8962648, 359)
Show SMILES CC(N)c1ccc(cc1F)-c1c(O)ccc2[nH]c(=O)c3sccc3c12
NCI pathway
Reactome pathway
US Patent
n/an/a 0.920n/an/an/an/a7.425
OncoTherapy Science, Inc.
US Patent
Assay Description
PBK activity was determined in the presence or absence of compounds using fluorescein isothiocyanate-labeled (FITC-labeled) histone H3 peptide as a s...
US Patent US8962648 (2015)
BindingDB Entry DOI: 10.7270/Q27H1H9K