BDBM149224 US8962651, 8
SMILES: CNC(=O)c1c(oc2nc(NCC(F)(F)F)c(cc12)-c1cccc(c1)C(=O)NC1(CC1)c1nc(C)no1)-c1ccc(F)cc1
InChI Key: InChIKey=IAJDHQMVDOYTBK-UHFFFAOYSA-N
Data: 1 IC50
Activity Spreadsheet -- Enzyme Inhibition Constant Data from BindingDB
Found 1 hit for monomerid = 149224
Trg + Lig
Ki
nM
ΔG°
kcal/mole
IC50
nM
Kd
nM
EC50/IC50
nM
koff
s-1
kon
M-1s-1
pHTemp
°C
RNA polymerase (NS5B)
(Hepatitis C virus (HCV))
BDBM149224
(US8962651, 8)
Show SMILES CNC(=O)c1c(oc2nc(NCC(F)(F)F)c(cc12)-c1cccc(c1)C(=O)NC1(CC1)c1nc(C)no1)-c1ccc(F)cc1
Show InChI InChI=1S/C30H24F4N6O4/c1-15-37-28(44-40-15)29(10-11-29)39-25(41)18-5-3-4-17(12-18)20-13-21-22(26(42)35-2)23(16-6-8-19(31)9-7-16)43-27(21)38-24(20)36-14-30(32,33)34/h3-9,12-13H,10-11,14H2,1-2H3,(H,35,42)(H,36,38)(H,39,41)
US Patent
n/an/a 4.80n/an/an/an/a7.525
Bristol-Myers Squibb Company
US Patent
Assay Description
An on-bead solid phase homogeneous assay was used in a 384-well format to assess NS5B inhibitors (WangY-K, Rigat K, Roberts S, and Gao M (2006) Anal ...
US Patent US8962651 (2015)
BindingDB Entry DOI: 10.7270/Q23R0RM9