BDBM149227 US8962651, 13
SMILES: CNC(=O)c1c(oc2nc(NCC(F)(F)F)c(cc12)-c1ccc(F)c(c1)C(=O)NC(C)(C)c1ncon1)-c1ccc(F)cc1
InChI Key: InChIKey=SEXJFHIUFVYGKW-UHFFFAOYSA-N
Data: 1 IC50
Activity Spreadsheet -- Enzyme Inhibition Constant Data from BindingDB
Found 1 hit for monomerid = 149227
Trg + Lig
Ki
nM
ΔG°
kcal/mole
IC50
nM
Kd
nM
EC50/IC50
nM
koff
s-1
kon
M-1s-1
pHTemp
°C
RNA polymerase (NS5B)
(Hepatitis C virus (HCV))
BDBM149227
(US8962651, 13)
Show SMILES CNC(=O)c1c(oc2nc(NCC(F)(F)F)c(cc12)-c1ccc(F)c(c1)C(=O)NC(C)(C)c1ncon1)-c1ccc(F)cc1
Show InChI InChI=1S/C29H23F5N6O4/c1-28(2,27-37-13-43-40-27)39-24(41)18-10-15(6-9-20(18)31)17-11-19-21(25(42)35-3)22(14-4-7-16(30)8-5-14)44-26(19)38-23(17)36-12-29(32,33)34/h4-11,13H,12H2,1-3H3,(H,35,42)(H,36,38)(H,39,41)
US Patent
n/an/a 3.42n/an/an/an/a7.525
Bristol-Myers Squibb Company
US Patent
Assay Description
An on-bead solid phase homogeneous assay was used in a 384-well format to assess NS5B inhibitors (WangY-K, Rigat K, Roberts S, and Gao M (2006) Anal ...
US Patent US8962651 (2015)
BindingDB Entry DOI: 10.7270/Q23R0RM9